Merge branch '539-shell-style-fixes' into 'master'

Resolve "rrsetorder test not portable"

Closes #539

See merge request isc-projects/bind9!784
26 jobs for xxx_joey-git-testing in 14 minutes and 27 seconds (queued for 3 seconds)
latest
Status Job ID Name Coverage
  Precheck
passed #70521
linux docker amd64
precheck:debian:sid:amd64

00:00:56

 
  Build
passed #70522
linux docker amd64
build:centos:centos6:amd64

00:04:47

passed #70523
linux docker amd64
build:centos:centos7:amd64

00:04:57

passed #70524
linux docker amd64
build:clang:debian:stretch:amd64

00:05:32

passed #70528
linux docker i386
build:clang:debian:stretch:i386

00:03:04

passed #70525
linux docker amd64
build:debian:jessie:amd64

00:04:08

passed #70527
linux docker amd64
build:debian:sid:amd64

00:04:37

passed #70529
linux docker i386
build:debian:sid:i386

00:05:52

passed #70526
linux docker amd64
build:debian:stretch:amd64

00:05:26

passed #70530
linux docker amd64
pkcs11:build:debian:sid:amd64

00:04:36

 
  Test
passed #70544
linux docker amd64
install:debian:sid:amd64

00:05:31

passed #70546
linux docker amd64
pkcs11:systemtest:debian:sid:amd64

00:04:44

passed #70545
linux docker amd64
pkcs11:unittest:debian:sid:amd64

00:03:07

passed #70538
linux docker amd64
systemtest:centos:centos6:amd64

00:04:51

passed #70539
linux docker amd64
systemtest:centos:centos7:amd64

00:04:41

passed #70540
linux docker amd64
systemtest:debian:jessie:amd64

00:04:56

failed #70542
linux docker amd64
systemtest:debian:sid:amd64

00:07:34

failed #70543
linux docker i386
systemtest:debian:sid:i386

00:07:25

passed #70541
linux docker amd64
systemtest:debian:stretch:amd64

00:07:05

passed #70531
linux docker amd64
unittest:centos:centos6:amd64

00:01:04

passed #70532
linux docker amd64
unittest:centos:centos7:amd64

00:03:23

passed #70536
linux docker amd64
unittest:clang:debian:stretch:amd64

00:03:11

passed #70533
linux docker amd64
unittest:debian:jessie:amd64

00:01:55

passed #70535
linux docker amd64
unittest:debian:sid:amd64

00:03:18

passed #70537
linux docker i386
unittest:debian:sid:i386

00:01:03

passed #70534
linux docker amd64
unittest:debian:stretch:amd64

00:03:04

 
Name Stage Failure
failed
systemtest:debian:sid:i386 Test
I:The following system tests failed:
I: eddsa
make[1]: Leaving directory '/builds/Joey/bind9/bin/tests/system'
make[1]: *** [Makefile:510: test] Error 1
make: *** [Makefile:479: test] Error 2
Uploading artifacts...
untracked: found 1287 files
Uploading artifacts to coordinator... ok id=70543 responseStatus=201 Created token=j2vGD5Wr
ERROR: Job failed: exit code 1
failed
systemtest:debian:sid:amd64 Test
I:The following system tests failed:
I: eddsa
make[1]: Leaving directory '/builds/Joey/bind9/bin/tests/system'
make[1]: *** [Makefile:510: test] Error 1
make: *** [Makefile:479: test] Error 2
Uploading artifacts...
untracked: found 1287 files
Uploading artifacts to coordinator... ok id=70542 responseStatus=201 Created token=uqCxb87A
ERROR: Job failed: exit code 1