CHANGES

73 jobs for !2946 with u/fanf2/dnssec-cds-no-sha1 in 27 minutes and 52 seconds (queued for 5 seconds)
latest detached
Status Job ID Name Coverage
  Precheck
passed #593343
amd64 linux
🐞:sid:amd64

00:04:02

passed #593341
amd64 linux
autoreconf:sid:amd64

00:00:43

passed #593342
amd64 linux
misc:sid:amd64

00:00:31

 
  Build
passed #593358
amd64 linux
asan:sid:amd64

00:04:46

passed #593365
amd64 freebsd
clang:freebsd11.3:amd64

00:01:12

passed #593366
amd64 freebsd
clang:freebsd12.0:amd64

00:01:03

passed #593367
amd64 openbsd
clang:openbsd6.5:amd64

00:08:35

passed #593362
amd64 linux
clang:stretch:amd64

00:03:18

passed #593363
i386 linux
clang:stretch:i386

00:01:50

passed #593344
amd64 linux
gcc:alpine3.11:amd64

00:02:28

passed #593357
amd64 linux
gcc:bionic:amd64

00:03:04

passed #593350
amd64 linux
gcc:buster:amd64

00:01:50

passed #593345
amd64 linux
gcc:centos6:amd64

00:02:19

passed #593346
amd64 linux
gcc:centos7:amd64

00:02:16

passed #593347
amd64 linux
gcc:centos8:amd64

00:03:03

passed #593355
amd64 linux
gcc:fedora31:amd64

00:02:25

passed #593348
amd64 linux
gcc:jessie:amd64

00:01:51

passed #593351
amd64 linux
gcc:sid:amd64

00:04:31

passed #593353
i386 linux
gcc:sid:i386

00:01:45

passed #593349
amd64 linux
gcc:stretch:amd64

00:01:45

passed #593354
amd64 linux
gcc:tumbleweed:amd64

00:02:27

passed #593356
amd64 linux
gcc:xenial:amd64

00:01:27

passed #593369
amd64 windows
msvc:windows:amd64

00:02:31

passed #593361
amd64 linux
mutexatomics:sid:amd64

00:02:44

passed #593368
amd64 linux
nolibtool:sid:amd64

00:02:34

passed #593352
amd64 linux
oot:sid:amd64

00:03:18

passed #593364
amd64 linux
pkcs11:sid:amd64

00:02:00

passed #593360
amd64 linux
rwlock:sid:amd64

00:01:33

passed #593359
amd64 linux
tsan:buster:amd64

00:03:22

 
  Unit
passed #593383
amd64 linux
unit:asan:sid:amd64

00:05:20

passed #593388
amd64 freebsd
unit:clang:freebsd11.3:amd64

00:00:31

passed #593389
amd64 freebsd
unit:clang:freebsd12.0:amd64

00:01:11

passed #593386
amd64 linux
unit:clang:stretch:amd64

00:00:53

passed #593370
amd64 linux
unit:gcc:alpine3.11:amd64

00:02:43

passed #593382
amd64 linux
unit:gcc:bionic:amd64

00:00:55

passed #593376
amd64 linux
unit:gcc:buster:amd64

00:01:25

passed #593371
amd64 linux
unit:gcc:centos6:amd64

00:00:55

passed #593372
amd64 linux
unit:gcc:centos7:amd64

00:01:10

passed #593373
amd64 linux
unit:gcc:centos8:amd64

00:00:57

passed #593380
amd64 linux
unit:gcc:fedora31:amd64

00:01:17

passed #593374
amd64 linux
unit:gcc:jessie:amd64

00:00:27

passed #593377
amd64 linux
unit:gcc:sid:amd64

00:01:24

passed #593378
i386 linux
unit:gcc:sid:i386

00:01:52

passed #593375
amd64 linux
unit:gcc:stretch:amd64

00:00:53

passed #593379
amd64 linux
unit:gcc:tumbleweed:amd64

00:01:21

passed #593381
amd64 linux
unit:gcc:xenial:amd64

00:01:11

passed #593390
amd64 linux
unit:nolibtool:sid:amd64

00:02:03

passed #593387
amd64 linux
unit:pkcs11:sid:amd64

00:01:27

passed #593385
amd64 linux
unit:rwlock:sid:amd64

00:01:39

failed #593384
amd64 linux allowed to fail
unit:tsan:buster:amd64

00:10:00

 
  System
passed #593404
amd64 linux
system:asan:sid:amd64

00:10:21

failed #593408
amd64 freebsd
system:clang:freebsd11.3:amd64

00:08:44

passed #593409
amd64 freebsd
system:clang:freebsd12.0:amd64

00:08:48

passed #593391
amd64 linux
system:gcc:alpine3.11:amd64

00:09:17

passed #593403
amd64 linux
system:gcc:bionic:amd64

00:09:43

passed #593397
amd64 linux
system:gcc:buster:amd64

00:09:19

passed #593392
amd64 linux
system:gcc:centos6:amd64

00:08:23

passed #593393
amd64 linux
system:gcc:centos7:amd64

00:08:38

passed #593394
amd64 linux
system:gcc:centos8:amd64

00:09:45

failed #593401
amd64 linux
system:gcc:fedora31:amd64

00:09:05

passed #593395
amd64 linux
system:gcc:jessie:amd64

00:08:08

failed #593398
amd64 linux
system:gcc:sid:amd64

00:09:16

passed #593399
i386 linux
system:gcc:sid:i386

00:09:01

failed #593396
amd64 linux
system:gcc:stretch:amd64

00:08:23

passed #593400
amd64 linux
system:gcc:tumbleweed:amd64

00:08:47

passed #593402
amd64 linux
system:gcc:xenial:amd64

00:07:54

failed #593410
amd64 linux
system:nolibtool:sid:amd64

00:10:00

passed #593407
amd64 linux
system:pkcs11:sid:amd64

00:08:34

passed #593406
amd64 linux
system:rwlock:sid:amd64

00:09:07

failed #593405
amd64 linux allowed to fail
system:tsan:buster:amd64

00:15:02

 
  Docs
passed #593411
amd64 linux
docs:sid:amd64

00:01:08

 
  Postcheck
passed #593413
amd64 linux
cppcheck:gcc:sid:amd64

00:03:01

passed #593412
amd64 linux
scan-build:buster:amd64

00:11:34

 
Name Stage Failure
failed
system:tsan:buster:amd64 System
make: *** [Makefile:486: test] Error 1
Running after script...
$ find bin -name 'tsan.*' -exec python3 util/parse_tsan.py {} \;
Uploading artifacts...
bin/tests/system/*/tsan.*: found 19 matching files
bin/tests/system/*/*/tsan.*: found 270 matching files

tsan/: found 238 matching files

Uploading artifacts to coordinator... ok
id=593405 responseStatus=201 Created token=5_1S5qmX
ERROR: Job failed: exit code 1
failed
system:nolibtool:sid:amd64 System
I:      1 FAIL
I: 97 PASS
I:The following system tests failed:
I: serve-stale
make: *** [Makefile:486: test] Error 1
Uploading artifacts...
untracked: found 896 files
Uploading artifacts to coordinator... ok
id=593410 responseStatus=201 Created token=tSFsufou
ERROR: Job failed: exit code 1
failed
system:gcc:fedora31:amd64 System
I:      1 FAIL
I: 97 PASS
I:The following system tests failed:
I: resolver
make: *** [Makefile:486: test] Error 1
Uploading artifacts...
untracked: found 1487 files
Uploading artifacts to coordinator... ok
id=593401 responseStatus=201 Created token=NbiDn1Hh
ERROR: Job failed: exit code 1
failed
system:gcc:sid:amd64 System
I:      1 FAIL
I: 98 PASS
I:The following system tests failed:
I: rpz
make: *** [Makefile:486: test] Error 1
Uploading artifacts...
untracked: found 1497 files
Uploading artifacts to coordinator... ok
id=593398 responseStatus=201 Created token=FFrKUeyE
ERROR: Job failed: exit code 1
failed
unit:tsan:buster:amd64 Unit
$ find lib -name 'tsan.*' -exec python3 util/parse_tsan.py {} \;
Uploading artifacts...
WARNING: lib/*/tests/tsan.*: no matching files
WARNING: tsan/: no matching files
kyua.log: found 1 matching files

kyua.results: found 1 matching files

WARNING: kyua_html/: no matching files
Uploading artifacts to coordinator... ok
id=593384 responseStatus=201 Created token=gJjf2gQn
ERROR: Job failed: exit code 1
failed
system:gcc:stretch:amd64 System
I:      1 SKIPPED
I:The following system tests failed:
I: rpzrecurse
Makefile:484: recipe for target 'test' failed
make: *** [test] Error 1
Uploading artifacts...
untracked: found 2706 files
Uploading artifacts to coordinator... ok
id=593396 responseStatus=201 Created token=xc-4eFm-
ERROR: Job failed: exit code 1
failed
system:clang:freebsd11.3:amd64 System
I:      masterformat
*** [test] Error code 1

make: stopped in /builds/fanf/bind9/bin/tests/system
Uploading artifacts...
Runtime platform arch=amd64 os=freebsd pid=51541 revision=de7731dd version=12.1.0
untracked: found 1380 files

Uploading artifacts to coordinator... ok
id=593408 responseStatus=201 Created token=2WTiXxiS
ERROR: Job failed: exit status 1