CHANGES

73 jobs for !2984 with u/fanf2/REQ/sig-signing-period in 16 minutes and 35 seconds (queued for 4 seconds)
latest detached
Status Job ID Name Coverage
  Precheck
passed #622198
amd64 linux
🐞:sid:amd64

00:03:49

passed #622196
amd64 linux
autoreconf:sid:amd64

00:00:20

failed #622197
amd64 linux
misc:sid:amd64

00:00:27

 
  Build
passed #622213
amd64 linux
asan:sid:amd64

00:05:19

passed #622220
amd64 freebsd
clang:freebsd11.3:amd64

00:01:07

passed #622221
amd64 freebsd
clang:freebsd12.0:amd64

00:01:00

passed #622222
amd64 openbsd
clang:openbsd6.5:amd64

00:08:00

passed #622217
amd64 linux
clang:stretch:amd64

00:02:12

passed #622218
i386 linux
clang:stretch:i386

00:03:34

passed #622199
amd64 linux
gcc:alpine3.11:amd64

00:02:36

passed #622212
amd64 linux
gcc:bionic:amd64

00:01:35

passed #622205
amd64 linux
gcc:buster:amd64

00:02:46

passed #622200
amd64 linux
gcc:centos6:amd64

00:02:11

passed #622201
amd64 linux
gcc:centos7:amd64

00:02:19

passed #622202
amd64 linux
gcc:centos8:amd64

00:02:27

passed #622210
amd64 linux
gcc:fedora31:amd64

00:02:09

passed #622203
amd64 linux
gcc:jessie:amd64

00:01:36

passed #622206
amd64 linux
gcc:sid:amd64

00:04:34

passed #622208
i386 linux
gcc:sid:i386

00:01:46

passed #622204
amd64 linux
gcc:stretch:amd64

00:02:43

passed #622209
amd64 linux
gcc:tumbleweed:amd64

00:02:20

passed #622211
amd64 linux
gcc:xenial:amd64

00:01:49

failed #622224
amd64 windows
msvc:windows:amd64

00:02:15

passed #622216
amd64 linux
mutexatomics:sid:amd64

00:01:48

passed #622223
amd64 linux
nolibtool:sid:amd64

00:03:48

passed #622207
amd64 linux
oot:sid:amd64

00:02:57

passed #622219
amd64 linux
pkcs11:sid:amd64

00:02:26

passed #622215
amd64 linux
rwlock:sid:amd64

00:02:37

passed #622214
amd64 linux
tsan:buster:amd64

00:03:29

 
  Unit
passed #622238
amd64 linux
unit:asan:sid:amd64

00:04:46

passed #622243
amd64 freebsd
unit:clang:freebsd11.3:amd64

00:00:33

passed #622244
amd64 freebsd
unit:clang:freebsd12.0:amd64

00:01:09

passed #622241
amd64 linux
unit:clang:stretch:amd64

00:00:43

passed #622225
amd64 linux
unit:gcc:alpine3.11:amd64

00:02:43

passed #622237
amd64 linux
unit:gcc:bionic:amd64

00:01:02

passed #622231
amd64 linux
unit:gcc:buster:amd64

00:01:44

passed #622226
amd64 linux
unit:gcc:centos6:amd64

00:00:44

passed #622227
amd64 linux
unit:gcc:centos7:amd64

00:00:58

passed #622228
amd64 linux
unit:gcc:centos8:amd64

00:01:33

passed #622235
amd64 linux
unit:gcc:fedora31:amd64

00:01:33

passed #622229
amd64 linux
unit:gcc:jessie:amd64

00:00:29

passed #622232
amd64 linux
unit:gcc:sid:amd64

00:01:40

passed #622233
i386 linux
unit:gcc:sid:i386

00:02:05

passed #622230
amd64 linux
unit:gcc:stretch:amd64

00:00:59

passed #622234
amd64 linux
unit:gcc:tumbleweed:amd64

00:01:32

passed #622236
amd64 linux
unit:gcc:xenial:amd64

00:01:03

passed #622245
amd64 linux
unit:nolibtool:sid:amd64

00:02:18

passed #622242
amd64 linux
unit:pkcs11:sid:amd64

00:01:35

passed #622240
amd64 linux
unit:rwlock:sid:amd64

00:01:12

failed #622239
amd64 linux allowed to fail
unit:tsan:buster:amd64

00:05:32

 
  System
passed #622259
amd64 linux
system:asan:sid:amd64

00:09:57

passed #622263
amd64 freebsd
system:clang:freebsd11.3:amd64

00:08:11

passed #622264
amd64 freebsd
system:clang:freebsd12.0:amd64

00:08:17

passed #622246
amd64 linux
system:gcc:alpine3.11:amd64

00:09:01

passed #622258
amd64 linux
system:gcc:bionic:amd64

00:08:29

passed #622252
amd64 linux
system:gcc:buster:amd64

00:08:23

passed #622247
amd64 linux
system:gcc:centos6:amd64

00:07:45

passed #622248
amd64 linux
system:gcc:centos7:amd64

00:07:42

passed #622249
amd64 linux
system:gcc:centos8:amd64

00:09:04

passed #622256
amd64 linux
system:gcc:fedora31:amd64

00:08:11

passed #622250
amd64 linux
system:gcc:jessie:amd64

00:07:59

passed #622253
amd64 linux
system:gcc:sid:amd64

00:07:59

passed #622254
i386 linux
system:gcc:sid:i386

00:08:22

passed #622251
amd64 linux
system:gcc:stretch:amd64

00:07:26

passed #622255
amd64 linux
system:gcc:tumbleweed:amd64

00:08:31

passed #622257
amd64 linux
system:gcc:xenial:amd64

00:08:55

passed #622265
amd64 linux
system:nolibtool:sid:amd64

00:09:02

passed #622262
amd64 linux
system:pkcs11:sid:amd64

00:06:59

passed #622261
amd64 linux
system:rwlock:sid:amd64

00:08:07

failed #622260
amd64 linux allowed to fail
system:tsan:buster:amd64

00:12:09

 
  Docs
passed #622266
amd64 linux
docs:sid:amd64

00:01:05

 
  Postcheck
failed #622268
amd64 linux
cppcheck:gcc:sid:amd64

00:03:02

passed #622267
amd64 linux
scan-build:buster:amd64

00:11:25

 
Name Stage Failure
failed
system:tsan:buster:amd64 System
make: *** [Makefile:486: test] Error 1
Running after script...
$ find bin -name 'tsan.*' -exec python3 util/parse_tsan.py {} \;
Uploading artifacts...
bin/tests/system/*/tsan.*: found 18 matching files
bin/tests/system/*/*/tsan.*: found 269 matching files

tsan/: found 246 matching files

Uploading artifacts to coordinator... ok
id=622260 responseStatus=201 Created token=iyyevp23
ERROR: Job failed: exit code 1
failed
unit:tsan:buster:amd64 Unit
$ find lib -name 'tsan.*' -exec python3 util/parse_tsan.py {} \;
Uploading artifacts...
WARNING: lib/*/tests/tsan.*: no matching files
WARNING: tsan/: no matching files
kyua.log: found 1 matching files

kyua.results: found 1 matching files

WARNING: kyua_html/: no matching files
Uploading artifacts to coordinator... ok
id=622239 responseStatus=201 Created token=CL1V1S9S
ERROR: Job failed: exit code 1
failed
cppcheck:gcc:sid:amd64 Postcheck


Open 'cppcheck_html//index.html' to see the results.
Uploading artifacts...
compile_commands.json: found 1 matching files
cppcheck.results: found 1 matching files

cppcheck_html/: found 12 matching files

Uploading artifacts to coordinator... ok
id=622268 responseStatus=201 Created token=YnSwhiWy
ERROR: Job failed: exit code 1
failed
msvc:windows:amd64 Build
       (Link target) -> 
zoneconf.obj : error LNK2019: unresolved external symbol dns_zone_setsigperiod referenced in function named_zone_configure [C:\builds\fanf\bind9\bin\named\win32\named.vcxproj]
..\..\..\Build\Release\named.exe : fatal error LNK1120: 1 unresolved externals [C:\builds\fanf\bind9\bin\named\win32\named.vcxproj]

728 Warning(s)
2 Error(s)

Time Elapsed 00:01:29.30
ERROR: Job failed: exit status 1
failed
misc:sid:amd64 Precheck
Skipping Git submodules setup
Authenticating with credentials from job payload (GitLab Registry)
$ sh util/check-ans-prereq.sh
$ sh util/checklibs.sh > checklibs.out
Uploading artifacts...
WARNING: util/newcopyrights: no matching files
checklibs.out: found 1 matching files

Uploading artifacts to coordinator... ok
id=622197 responseStatus=201 Created token=cPCAjALG
ERROR: Job failed: exit code 1