make dns_adbentry_t->active atomic

Status Job ID Name Coverage
  Precheck
passed #425769
amd64 linux
🐞:sid:amd64

00:03:04

passed #425767
amd64 linux
autoreconf:sid:amd64

00:00:32

passed #425768
amd64 linux
misc:sid:amd64

00:00:23

 
  Build
passed #425782
amd64 linux
asan:sid:amd64

00:01:45

passed #425788
amd64 freebsd
clang:freebsd11.3:amd64

00:01:07

passed #425789
amd64 freebsd
clang:freebsd12.0:amd64

00:00:59

passed #425790
amd64 openbsd
clang:openbsd6.5:amd64

00:04:26

passed #425785
amd64 linux
clang:stretch:amd64

00:01:35

passed #425786
i386 linux
clang:stretch:i386

00:01:21

passed #425770
amd64 linux
gcc:alpine3.10:amd64

00:02:14

passed #425781
amd64 linux
gcc:bionic:amd64

00:01:31

passed #425776
amd64 linux
gcc:buster:amd64

00:01:24

passed #425771
amd64 linux
gcc:centos6:amd64

00:01:29

passed #425772
amd64 linux
gcc:centos7:amd64

00:02:02

passed #425773
amd64 linux
gcc:centos8:amd64

00:01:43

passed #425779
amd64 linux
gcc:fedora30:amd64

00:02:12

passed #425774
amd64 linux
gcc:jessie:amd64

00:01:53

passed #425777
amd64 linux
gcc:sid:amd64

00:01:54

passed #425778
i386 linux
gcc:sid:i386

00:01:33

passed #425775
amd64 linux
gcc:stretch:amd64

00:00:58

passed #425780
amd64 linux
gcc:xenial:amd64

00:01:31

passed #425792
amd64 windows
msvc:windows:amd64

00:03:23

failed #425784
amd64 linux
mutexatomics:sid:amd64

00:00:51

passed #425791
amd64 linux
nolibtool:sid:amd64

00:02:02

passed #425787
amd64 linux
pkcs11:sid:amd64

00:01:25

passed #425783
amd64 linux
rwlock:sid:amd64

00:01:18

 
  Unit
passed #425805
amd64 linux
unit:asan:sid:amd64

00:04:08

failed #425846
freebsd amd64
unit:clang:freebsd11.3:amd64

00:05:08

passed #425810
amd64 freebsd
unit:clang:freebsd12.0:amd64

00:01:07

passed #425807
amd64 linux
unit:clang:stretch:amd64

00:00:35

passed #425793
amd64 linux
unit:gcc:alpine3.10:amd64

00:02:17

passed #425804
amd64 linux
unit:gcc:bionic:amd64

00:00:50

passed #425799
amd64 linux
unit:gcc:buster:amd64

00:01:22

passed #425794
amd64 linux
unit:gcc:centos6:amd64

00:00:53

passed #425795
amd64 linux
unit:gcc:centos7:amd64

00:00:52

passed #425796
amd64 linux
unit:gcc:centos8:amd64

00:00:52

passed #425802
amd64 linux
unit:gcc:fedora30:amd64

00:01:24

passed #425797
amd64 linux
unit:gcc:jessie:amd64

00:00:20

passed #425800
amd64 linux
unit:gcc:sid:amd64

00:01:16

passed #425801
i386 linux
unit:gcc:sid:i386

00:02:00

passed #425798
amd64 linux
unit:gcc:stretch:amd64

00:00:48

passed #425803
amd64 linux
unit:gcc:xenial:amd64

00:00:52

passed #425811
amd64 linux
unit:nolibtool:sid:amd64

00:01:38

passed #425808
amd64 linux
unit:pkcs11:sid:amd64

00:01:20

passed #425806
amd64 linux
unit:rwlock:sid:amd64

00:01:02

failed #425809
amd64 freebsd
unit:clang:freebsd11.3:amd64

00:05:08

 
  System
passed #425839
linux amd64
system:asan:sid:amd64

00:09:21

failed #425847
freebsd amd64
system:clang:freebsd11.3:amd64

00:08:16

passed #425828
amd64 freebsd
system:clang:freebsd12.0:amd64

00:08:32

passed #425812
amd64 linux
system:gcc:alpine3.10:amd64

00:08:24

passed #425823
amd64 linux
system:gcc:bionic:amd64

00:07:29

passed #425837
linux amd64
system:gcc:buster:amd64

00:07:40

passed #425813
amd64 linux
system:gcc:centos6:amd64

00:07:46

passed #425840
linux amd64
system:gcc:centos7:amd64

00:07:34

passed #425842
amd64 linux
system:gcc:centos8:amd64

00:07:05

passed #425838
linux amd64
system:gcc:fedora30:amd64

00:07:05

passed #425816
amd64 linux
system:gcc:jessie:amd64

00:06:56

passed #425819
amd64 linux
system:gcc:sid:amd64

00:07:49

passed #425820
i386 linux
system:gcc:sid:i386

00:08:10

passed #425833
linux amd64
system:gcc:stretch:amd64

00:06:41

passed #425822
amd64 linux
system:gcc:xenial:amd64

00:06:51

passed #425829
amd64 linux
system:nolibtool:sid:amd64

00:08:22

passed #425826
amd64 linux
system:pkcs11:sid:amd64

00:07:49

passed #425841
amd64 linux
system:rwlock:sid:amd64

00:06:52

failed #425824
amd64 linux
system:asan:sid:amd64

00:09:42

failed #425836
freebsd amd64
system:clang:freebsd11.3:amd64

00:08:07

failed #425827
amd64 freebsd
system:clang:freebsd11.3:amd64

00:08:40

failed #425843
amd64 freebsd
system:clang:freebsd11.3:amd64

00:08:13

failed #425818
amd64 linux
system:gcc:buster:amd64

00:09:00

failed #425814
amd64 linux
system:gcc:centos7:amd64

00:10:32

failed #425815
amd64 linux
system:gcc:centos8:amd64

00:07:36

failed #425834
linux amd64
system:gcc:centos8:amd64

00:07:50

failed #425821
amd64 linux
system:gcc:fedora30:amd64

00:08:15

failed #425817
amd64 linux
system:gcc:stretch:amd64

00:07:37

failed #425825
amd64 linux
system:rwlock:sid:amd64

00:08:25

failed #425835
linux amd64
system:rwlock:sid:amd64

00:07:28

 
  Docs
passed #425830
amd64 linux
docs:sid:amd64

00:01:05

 
  Postcheck
passed #425832
amd64 linux
cppcheck:gcc:sid:amd64

00:01:26

passed #425831
amd64 linux
scan-build:buster:amd64

00:10:14

 
Name Stage Failure
failed
system:clang:freebsd11.3:amd64 System
I:      resolver
*** [test] Error code 1

make: stopped in /builds/isc-projects/bind9/bin/tests/system
Uploading artifacts...
Runtime platform arch=amd64 os=freebsd pid=46073 revision=de7731dd version=12.1.0
untracked: found 1454 files

Uploading artifacts to coordinator... ok
id=425847 responseStatus=201 Created token=3z6Nnhs8
ERROR: Job failed: exit status 1
failed
unit:clang:freebsd11.3:amd64 Unit
Generating kyua_html/report.css
Generating kyua_html/index.html
Uploading artifacts...
Runtime platform arch=amd64 os=freebsd pid=87137 revision=de7731dd version=12.1.0
kyua.log: found 1 matching files

kyua.results: found 1 matching files

kyua_html/: found 70 matching files

Uploading artifacts to coordinator... ok
id=425846 responseStatus=201 Created token=2t52eiDF
ERROR: Job failed: exit status 1
failed
mutexatomics:sid:amd64 Build
make[2]: Leaving directory '/builds/isc-projects/bind9/lib/dns'
make[2]: Target 'all' not remade because of errors.
make[1]: *** [Makefile:84: subdirs] Error 1
make[1]: Target 'all' not remade because of errors.
make[1]: Leaving directory '/builds/isc-projects/bind9/lib'
make: *** [Makefile:87: subdirs] Error 1
make: Target 'all' not remade because of errors.
Authenticating with credentials from /root/.docker/config.json
ERROR: Job failed: exit code 1