Revert "Skip the runtime ellipsis test"

This reverts commit 161e0284.
102 jobs for !2572 with fix-tests-timing-issues in 35 minutes and 11 seconds (queued for 5 minutes and 36 seconds)
latest detached
Status Job ID Name Coverage
  Precheck
passed #431994
amd64 linux
🐞:sid:amd64

00:03:08

passed #431992
amd64 linux
autoreconf:sid:amd64

00:00:33

passed #431993
amd64 linux
misc:sid:amd64

00:00:19

 
  Build
passed #432007
amd64 linux
asan:sid:amd64

00:01:59

passed #432013
amd64 freebsd
clang:freebsd11.3:amd64

00:01:21

passed #432014
amd64 freebsd
clang:freebsd12.0:amd64

00:01:12

passed #432015
amd64 openbsd
clang:openbsd6.5:amd64

00:04:21

passed #432010
amd64 linux
clang:stretch:amd64

00:01:39

passed #432011
i386 linux
clang:stretch:i386

00:01:33

passed #431995
amd64 linux
gcc:alpine3.10:amd64

00:02:11

passed #432006
amd64 linux
gcc:bionic:amd64

00:02:10

passed #432001
amd64 linux
gcc:buster:amd64

00:01:19

passed #431996
amd64 linux
gcc:centos6:amd64

00:01:52

passed #431997
amd64 linux
gcc:centos7:amd64

00:01:30

passed #431998
amd64 linux
gcc:centos8:amd64

00:02:03

passed #432004
amd64 linux
gcc:fedora30:amd64

00:02:07

passed #431999
amd64 linux
gcc:jessie:amd64

00:01:51

passed #432002
amd64 linux
gcc:sid:amd64

00:02:19

passed #432003
i386 linux
gcc:sid:i386

00:01:00

passed #432000
amd64 linux
gcc:stretch:amd64

00:00:57

passed #432005
amd64 linux
gcc:xenial:amd64

00:00:57

passed #432017
amd64 windows
msvc:windows:amd64

00:02:31

passed #432009
amd64 linux
mutexatomics:sid:amd64

00:01:32

passed #432016
amd64 linux
nolibtool:sid:amd64

00:02:06

passed #432012
amd64 linux
pkcs11:sid:amd64

00:01:34

passed #432008
amd64 linux
rwlock:sid:amd64

00:01:28

 
  Unit
passed #432030
amd64 linux
unit:asan:sid:amd64

00:04:24

failed #432034
amd64 freebsd
unit:clang:freebsd11.3:amd64

00:00:32

failed #432035
amd64 freebsd
unit:clang:freebsd12.0:amd64

00:05:09

passed #432032
amd64 linux
unit:clang:stretch:amd64

00:00:48

passed #432018
amd64 linux
unit:gcc:alpine3.10:amd64

00:02:35

passed #432029
amd64 linux
unit:gcc:bionic:amd64

00:00:48

passed #432024
amd64 linux
unit:gcc:buster:amd64

00:01:09

passed #432019
amd64 linux
unit:gcc:centos6:amd64

00:00:54

passed #432020
amd64 linux
unit:gcc:centos7:amd64

00:00:53

passed #432021
amd64 linux
unit:gcc:centos8:amd64

00:00:40

passed #432027
amd64 linux
unit:gcc:fedora30:amd64

00:01:15

passed #432022
amd64 linux
unit:gcc:jessie:amd64

00:00:29

passed #432025
amd64 linux
unit:gcc:sid:amd64

00:01:18

passed #432026
i386 linux
unit:gcc:sid:i386

00:01:36

passed #432023
amd64 linux
unit:gcc:stretch:amd64

00:00:51

passed #432028
amd64 linux
unit:gcc:xenial:amd64

00:00:42

passed #432036
amd64 linux
unit:nolibtool:sid:amd64

00:01:34

passed #432033
amd64 linux
unit:pkcs11:sid:amd64

00:01:04

passed #432031
amd64 linux
unit:rwlock:sid:amd64

00:01:17

 
  System
canceled #432265
amd64 linux
system:asan:sid:amd64

00:10:18

canceled #432118
amd64 freebsd
system:clang:freebsd11.3:amd64

00:14:58

failed #432110
amd64 freebsd
system:clang:freebsd12.0:amd64

00:08:55

failed #432188
amd64 linux
system:gcc:alpine3.10:amd64

00:08:55

failed #432113
amd64 linux
system:gcc:bionic:amd64

00:07:19

failed #432114
amd64 linux
system:gcc:buster:amd64

00:08:19

failed #432108
amd64 linux
system:gcc:centos6:amd64

00:07:23

failed #432106
amd64 linux
system:gcc:centos7:amd64

00:07:27

failed #432112
amd64 linux
system:gcc:centos8:amd64

00:08:11

failed #432187
amd64 linux
system:gcc:fedora30:amd64

00:08:41

failed #432107
amd64 linux
system:gcc:jessie:amd64

00:07:23

failed #432119
amd64 linux
system:gcc:sid:amd64

00:08:28

failed #432191
i386 linux
system:gcc:sid:i386

00:08:32

failed #432109
amd64 linux
system:gcc:stretch:amd64

00:07:21

failed #432105
amd64 linux
system:gcc:xenial:amd64

00:07:06

failed #432196
amd64 linux
system:nolibtool:sid:amd64

00:09:38

failed #432192
amd64 linux
system:pkcs11:sid:amd64

00:08:17

failed #432120
amd64 linux
system:rwlock:sid:amd64

00:08:09

failed #432102
linux amd64
system:asan:sid:amd64

00:09:48

failed #432049
amd64 linux
system:asan:sid:amd64

00:10:05

failed #432088
freebsd amd64
system:clang:freebsd11.3:amd64

00:09:11

failed #432052
amd64 freebsd
system:clang:freebsd11.3:amd64

00:11:02

failed #432053
amd64 freebsd
system:clang:freebsd12.0:amd64

00:11:04

failed #432084
freebsd amd64
system:clang:freebsd12.0:amd64

00:09:08

failed #432037
amd64 linux
system:gcc:alpine3.10:amd64

00:09:33

failed #432097
linux amd64
system:gcc:alpine3.10:amd64

00:08:30

failed #432094
linux amd64
system:gcc:bionic:amd64

00:07:31

failed #432048
amd64 linux
system:gcc:bionic:amd64

00:07:16

failed #432043
amd64 linux
system:gcc:buster:amd64

00:08:01

failed #432092
linux amd64
system:gcc:buster:amd64

00:07:57

failed #432085
linux amd64
system:gcc:centos6:amd64

00:07:50

failed #432038
amd64 linux
system:gcc:centos6:amd64

00:07:38

failed #432039
amd64 linux
system:gcc:centos7:amd64

00:07:50

failed #432089
linux amd64
system:gcc:centos7:amd64

00:06:59

failed #432040
amd64 linux
system:gcc:centos8:amd64

00:07:32

failed #432086
linux amd64
system:gcc:centos8:amd64

00:08:20

failed #432096
linux amd64
system:gcc:fedora30:amd64

00:08:26

failed #432046
amd64 linux
system:gcc:fedora30:amd64

00:08:04

failed #432087
linux amd64
system:gcc:jessie:amd64

00:07:26

failed #432041
amd64 linux
system:gcc:jessie:amd64

00:07:34

failed #432093
linux amd64
system:gcc:sid:amd64

00:08:08

failed #432044
amd64 linux
system:gcc:sid:amd64

00:07:59

failed #432045
i386 linux
system:gcc:sid:i386

00:09:03

failed #432098
linux i386
system:gcc:sid:i386

00:08:39

failed #432090
linux amd64
system:gcc:stretch:amd64

00:07:22

failed #432042
amd64 linux
system:gcc:stretch:amd64

00:07:41

failed #432091
linux amd64
system:gcc:xenial:amd64

00:06:38

failed #432047
amd64 linux
system:gcc:xenial:amd64

00:07:42

failed #432101
linux amd64
system:nolibtool:sid:amd64

00:09:25

failed #432054
amd64 linux
system:nolibtool:sid:amd64

00:09:30

failed #432051
amd64 linux
system:pkcs11:sid:amd64

00:08:28

failed #432099
linux amd64
system:pkcs11:sid:amd64

00:08:20

failed #432050
amd64 linux
system:rwlock:sid:amd64

00:08:17

failed #432095
linux amd64
system:rwlock:sid:amd64

00:08:22

 
  Docs
passed #432055
amd64 linux
docs:sid:amd64

00:01:05

 
  Postcheck
passed #432057
amd64 linux
cppcheck:gcc:sid:amd64

00:01:37

passed #432056
amd64 linux
scan-build:buster:amd64

00:10:51

 
Name Stage Failure
failed
system:nolibtool:sid:amd64 System
I:The following system tests failed:
I: mkeys
I: runtime
make: *** [Makefile:486: test] Error 1
Authenticating with credentials from /root/.docker/config.json
Uploading artifacts...
untracked: found 908 files

Uploading artifacts to coordinator... ok
id=432196 responseStatus=201 Created token=vWpNY52M
ERROR: Job failed: exit code 1
failed
system:gcc:alpine3.10:amd64 System
I:      1 FAIL
I: 96 PASS
I:The following system tests failed:
I: runtime
make: *** [Makefile:486: test] Error 1
Uploading artifacts...
untracked: found 1393 files
Uploading artifacts to coordinator... ok
id=432188 responseStatus=201 Created token=x2dBZLQA
ERROR: Job failed: exit code 1
failed
system:gcc:sid:i386 System
I:      3 UNTESTED
I:The following system tests failed:
I: mkeys
I: runtime
make: *** [Makefile:486: test] Error 1
Uploading artifacts...
untracked: found 1435 files
Uploading artifacts to coordinator... ok
id=432191 responseStatus=201 Created token=gaBtpHVN
ERROR: Job failed: exit code 1
failed
system:pkcs11:sid:amd64 System
I:      1 PKCS11ONLY
I: 2 SKIPPED
I:The following system tests failed:
I: runtime
make: *** [Makefile:486: test] Error 1
Uploading artifacts...
untracked: found 1381 files
Uploading artifacts to coordinator... ok
id=432192 responseStatus=201 Created token=7YeHEwGt
ERROR: Job failed: exit code 1
failed
system:gcc:fedora30:amd64 System
I:     94 PASS
I:The following system tests failed:
I: mkeys
I: runtime
make: *** [Makefile:486: test] Error 1
Uploading artifacts...
untracked: found 1481 files
Uploading artifacts to coordinator... ok
id=432187 responseStatus=201 Created token=9ggesCce
ERROR: Job failed: exit code 1
failed
system:rwlock:sid:amd64 System
I:     95 PASS
I:The following system tests failed:
I: runtime
make: *** [Makefile:486: test] Error 1
Authenticating with credentials from /root/.docker/config.json
Uploading artifacts...
untracked: found 1346 files

Uploading artifacts to coordinator... ok
id=432120 responseStatus=201 Created token=Mes25GUp
ERROR: Job failed: exit code 1
failed
system:gcc:sid:amd64 System
I:     95 PASS
I:The following system tests failed:
I: mkeys
I: runtime
make: *** [Makefile:486: test] Error 1
Uploading artifacts...
untracked: found 1537 files
Uploading artifacts to coordinator... ok
id=432119 responseStatus=201 Created token=TejtngBS
ERROR: Job failed: exit code 1
failed
system:clang:freebsd12.0:amd64 System
I:      runtime
*** [test] Error code 1

make: stopped in /builds/isc-projects/bind9/bin/tests/system
Uploading artifacts...
Runtime platform arch=amd64 os=freebsd pid=97024 revision=de7731dd version=12.1.0
untracked: found 1381 files

Uploading artifacts to coordinator... ok
id=432110 responseStatus=201 Created token=qHnECkN7
ERROR: Job failed: exit status 1
failed
system:gcc:buster:amd64 System
I:      1 FAIL
I: 95 PASS
I:The following system tests failed:
I: runtime
make: *** [Makefile:486: test] Error 1
Uploading artifacts...
untracked: found 1767 files
Uploading artifacts to coordinator... ok
id=432114 responseStatus=201 Created token=6gWyVfU6
ERROR: Job failed: exit code 1
failed
system:gcc:centos8:amd64 System
I:      1 FAIL
I: 95 PASS
I:The following system tests failed:
I: runtime
make: *** [Makefile:486: test] Error 1
Uploading artifacts...
untracked: found 1380 files
Uploading artifacts to coordinator... ok
id=432112 responseStatus=201 Created token=_-PwG5kn
ERROR: Job failed: exit code 1
failed
system:gcc:bionic:amd64 System
I:     95 PASS
I:The following system tests failed:
I: runtime
Makefile:484: recipe for target 'test' failed
make: *** [test] Error 1
Uploading artifacts...
untracked: found 1346 files
Uploading artifacts to coordinator... ok
id=432113 responseStatus=201 Created token=1YxNZHQK
ERROR: Job failed: exit code 1
failed
system:gcc:stretch:amd64 System
I:      1 SKIPPED
I:The following system tests failed:
I: runtime
Makefile:484: recipe for target 'test' failed
make: *** [test] Error 1
Uploading artifacts...
untracked: found 1346 files
Uploading artifacts to coordinator... ok
id=432109 responseStatus=201 Created token=2YXP9iML
ERROR: Job failed: exit code 1
failed
system:gcc:centos6:amd64 System
I:      1 SKIPPED
I:The following system tests failed:
I: runtime
make: *** [test] Error 1
Authenticating with credentials from /root/.docker/config.json
Uploading artifacts...
untracked: found 1379 files

Uploading artifacts to coordinator... ok
id=432108 responseStatus=201 Created token=Z5Bjr9X4
ERROR: Job failed: exit code 1
failed
system:gcc:jessie:amd64 System
I:The following system tests failed:
I: mkeys
I: runtime
Makefile:484: recipe for target 'test' failed
make: *** [test] Error 1
Uploading artifacts...
untracked: found 1193 files
Uploading artifacts to coordinator... ok
id=432107 responseStatus=201 Created token=m4XcxS_6
ERROR: Job failed: exit code 1
failed
system:gcc:centos7:amd64 System
I:     95 PASS
I: 1 SKIPPED
I:The following system tests failed:
I: runtime
make: *** [test] Error 1
Uploading artifacts...
untracked: found 1392 files
Uploading artifacts to coordinator... ok
id=432106 responseStatus=201 Created token=_ZzDyrzw
ERROR: Job failed: exit code 1
failed
system:gcc:xenial:amd64 System
I:      2 SKIPPED
I:The following system tests failed:
I: runtime
Makefile:484: recipe for target 'test' failed
make: *** [test] Error 1
Uploading artifacts...
untracked: found 1375 files
Uploading artifacts to coordinator... ok
id=432105 responseStatus=201 Created token=gqjktwUr
ERROR: Job failed: exit code 1
failed
unit:clang:freebsd12.0:amd64 Unit
Generating kyua_html/report.css
Generating kyua_html/index.html
Uploading artifacts...
Runtime platform arch=amd64 os=freebsd pid=77129 revision=de7731dd version=12.1.0
kyua.log: found 1 matching files

kyua.results: found 1 matching files

kyua_html/: found 70 matching files

Uploading artifacts to coordinator... ok
id=432035 responseStatus=201 Created token=EHd38DzY
ERROR: Job failed: exit status 1
failed
unit:clang:freebsd11.3:amd64 Unit
Generating kyua_html/report.css
Generating kyua_html/index.html
Uploading artifacts...
Runtime platform arch=amd64 os=freebsd pid=40242 revision=de7731dd version=12.1.0
kyua.log: found 1 matching files

kyua.results: found 1 matching files

kyua_html/: found 70 matching files

Uploading artifacts to coordinator... ok
id=432034 responseStatus=201 Created token=9WKHymV2
ERROR: Job failed: exit status 1