Stop retrying the system tests; we should fix the tests instead

66 jobs for !2649 with ondrej/stop-retrying-system-tests in 12 minutes and 57 seconds (queued for 6 seconds)
latest detached
Status Job ID Name Coverage
  Precheck
passed #440034
amd64 linux
🐞:sid:amd64

00:03:03

passed #440032
amd64 linux
autoreconf:sid:amd64

00:00:33

passed #440033
amd64 linux
misc:sid:amd64

00:00:17

 
  Build
passed #440047
amd64 linux
asan:sid:amd64

00:01:46

passed #440053
amd64 freebsd
clang:freebsd11.3:amd64

00:01:10

passed #440054
amd64 freebsd
clang:freebsd12.0:amd64

00:00:59

passed #440055
amd64 openbsd
clang:openbsd6.5:amd64

00:04:27

passed #440050
amd64 linux
clang:stretch:amd64

00:01:26

passed #440051
i386 linux
clang:stretch:i386

00:01:00

passed #440035
amd64 linux
gcc:alpine3.10:amd64

00:02:16

passed #440046
amd64 linux
gcc:bionic:amd64

00:01:20

passed #440041
amd64 linux
gcc:buster:amd64

00:01:30

passed #440036
amd64 linux
gcc:centos6:amd64

00:01:55

passed #440037
amd64 linux
gcc:centos7:amd64

00:02:15

passed #440038
amd64 linux
gcc:centos8:amd64

00:02:24

passed #440044
amd64 linux
gcc:fedora30:amd64

00:02:22

passed #440039
amd64 linux
gcc:jessie:amd64

00:01:20

passed #440042
amd64 linux
gcc:sid:amd64

00:02:15

passed #440043
i386 linux
gcc:sid:i386

00:01:39

passed #440040
amd64 linux
gcc:stretch:amd64

00:01:37

passed #440045
amd64 linux
gcc:xenial:amd64

00:01:29

passed #440057
amd64 windows
msvc:windows:amd64

00:02:18

passed #440049
amd64 linux
mutexatomics:sid:amd64

00:01:32

passed #440056
amd64 linux
nolibtool:sid:amd64

00:02:04

passed #440052
amd64 linux
pkcs11:sid:amd64

00:01:30

passed #440048
amd64 linux
rwlock:sid:amd64

00:00:56

 
  Unit
passed #440070
amd64 linux
unit:asan:sid:amd64

00:04:08

passed #440074
amd64 freebsd
unit:clang:freebsd11.3:amd64

00:00:35

passed #440075
amd64 freebsd
unit:clang:freebsd12.0:amd64

00:01:07

passed #440072
amd64 linux
unit:clang:stretch:amd64

00:00:49

passed #440058
amd64 linux
unit:gcc:alpine3.10:amd64

00:02:45

passed #440069
amd64 linux
unit:gcc:bionic:amd64

00:00:38

passed #440064
amd64 linux
unit:gcc:buster:amd64

00:01:22

passed #440059
amd64 linux
unit:gcc:centos6:amd64

00:00:40

passed #440060
amd64 linux
unit:gcc:centos7:amd64

00:00:59

passed #440061
amd64 linux
unit:gcc:centos8:amd64

00:00:59

passed #440067
amd64 linux
unit:gcc:fedora30:amd64

00:01:31

passed #440062
amd64 linux
unit:gcc:jessie:amd64

00:00:29

passed #440065
amd64 linux
unit:gcc:sid:amd64

00:01:16

passed #440066
i386 linux
unit:gcc:sid:i386

00:01:49

passed #440063
amd64 linux
unit:gcc:stretch:amd64

00:00:50

passed #440068
amd64 linux
unit:gcc:xenial:amd64

00:00:53

passed #440076
amd64 linux
unit:nolibtool:sid:amd64

00:01:46

passed #440073
amd64 linux
unit:pkcs11:sid:amd64

00:01:19

passed #440071
amd64 linux
unit:rwlock:sid:amd64

00:01:10

 
  System
passed #440089
amd64 linux
system:asan:sid:amd64

00:09:26

failed #440092
amd64 freebsd
system:clang:freebsd11.3:amd64

00:08:53

failed #440093
amd64 freebsd
system:clang:freebsd12.0:amd64

00:08:32

passed #440077
amd64 linux
system:gcc:alpine3.10:amd64

00:08:34

passed #440088
amd64 linux
system:gcc:bionic:amd64

00:07:02

passed #440083
amd64 linux
system:gcc:buster:amd64

00:08:08

failed #440078
amd64 linux
system:gcc:centos6:amd64

00:07:29

passed #440079
amd64 linux
system:gcc:centos7:amd64

00:07:45

passed #440080
amd64 linux
system:gcc:centos8:amd64

00:07:23

passed #440086
amd64 linux
system:gcc:fedora30:amd64

00:07:45

failed #440081
amd64 linux
system:gcc:jessie:amd64

00:08:11

failed #440084
amd64 linux
system:gcc:sid:amd64

00:08:24

passed #440085
i386 linux
system:gcc:sid:i386

00:08:01

passed #440082
amd64 linux
system:gcc:stretch:amd64

00:07:15

passed #440087
amd64 linux
system:gcc:xenial:amd64

00:06:48

passed #440094
amd64 linux
system:nolibtool:sid:amd64

00:08:03

passed #440091
amd64 linux
system:pkcs11:sid:amd64

00:07:29

failed #440090
amd64 linux
system:rwlock:sid:amd64

00:08:26

 
  Docs
passed #440095
amd64 linux
docs:sid:amd64

00:01:00

 
  Postcheck
passed #440097
amd64 linux
cppcheck:gcc:sid:amd64

00:01:35

passed #440096
amd64 linux
scan-build:buster:amd64

00:10:30

 
Name Stage Failure
failed
system:gcc:centos6:amd64 System
I:     94 PASS
I: 1 SKIPPED
I:The following system tests failed:
I: fetchlimit
make: *** [test] Error 1
Uploading artifacts...
untracked: found 1369 files
Uploading artifacts to coordinator... ok
id=440078 responseStatus=201 Created token=wiatBqFX
ERROR: Job failed: exit code 1
failed
system:clang:freebsd11.3:amd64 System
I:      statistics
*** [test] Error code 1

make: stopped in /builds/isc-projects/bind9/bin/tests/system
Uploading artifacts...
Runtime platform arch=amd64 os=freebsd pid=9864 revision=de7731dd version=12.1.0
untracked: found 1758 files

Uploading artifacts to coordinator... ok
id=440092 responseStatus=201 Created token=SsLvnUTX
ERROR: Job failed: exit status 1
failed
system:rwlock:sid:amd64 System
I:      1 FAIL
I: 95 PASS
I:The following system tests failed:
I: addzone
make: *** [Makefile:486: test] Error 1
Uploading artifacts...
untracked: found 1427 files
Uploading artifacts to coordinator... ok
id=440090 responseStatus=201 Created token=zDkqsVzP
ERROR: Job failed: exit code 1
failed
system:clang:freebsd12.0:amd64 System
I:      qmin
*** [test] Error code 1

make: stopped in /builds/isc-projects/bind9/bin/tests/system
Uploading artifacts...
Runtime platform arch=amd64 os=freebsd pid=6682 revision=de7731dd version=12.1.0
untracked: found 1390 files

Uploading artifacts to coordinator... ok
id=440093 responseStatus=201 Created token=DGzuFaa9
ERROR: Job failed: exit status 1
failed
system:gcc:jessie:amd64 System
I:      2 SKIPPED
I:The following system tests failed:
I: dnssec
Makefile:484: recipe for target 'test' failed
make: *** [test] Error 1
Uploading artifacts...
untracked: found 2153 files
Uploading artifacts to coordinator... ok
id=440081 responseStatus=201 Created token=RBi5RfT_
ERROR: Job failed: exit code 1
failed
system:gcc:sid:amd64 System
I:      1 FAIL
I: 96 PASS
I:The following system tests failed:
I: fetchlimit
make: *** [Makefile:486: test] Error 1
Uploading artifacts...
untracked: found 1426 files
Uploading artifacts to coordinator... ok
id=440084 responseStatus=201 Created token=B3EPwsxm
ERROR: Job failed: exit code 1