make FCTX_ATTR_SHUTTINGDOWN a independent bool

Status Job ID Name Coverage
  Precheck
passed #441483
amd64 linux
🐞:sid:amd64

00:03:13

passed #441481
amd64 linux
autoreconf:sid:amd64

00:00:33

passed #441482
amd64 linux
misc:sid:amd64

00:00:17

 
  Build
passed #441496
amd64 linux
asan:sid:amd64

00:01:45

passed #441502
amd64 freebsd
clang:freebsd11.3:amd64

00:01:09

passed #441503
amd64 freebsd
clang:freebsd12.0:amd64

00:01:00

passed #441504
amd64 openbsd
clang:openbsd6.5:amd64

00:04:40

passed #441499
amd64 linux
clang:stretch:amd64

00:01:33

passed #441500
i386 linux
clang:stretch:i386

00:01:25

passed #441484
amd64 linux
gcc:alpine3.10:amd64

00:02:24

passed #441495
amd64 linux
gcc:bionic:amd64

00:01:33

passed #441490
amd64 linux
gcc:buster:amd64

00:02:01

passed #441485
amd64 linux
gcc:centos6:amd64

00:01:56

passed #441486
amd64 linux
gcc:centos7:amd64

00:02:11

passed #441487
amd64 linux
gcc:centos8:amd64

00:02:12

passed #441493
amd64 linux
gcc:fedora30:amd64

00:02:08

passed #441488
amd64 linux
gcc:jessie:amd64

00:01:21

passed #441491
amd64 linux
gcc:sid:amd64

00:02:19

passed #441492
i386 linux
gcc:sid:i386

00:01:32

passed #441489
amd64 linux
gcc:stretch:amd64

00:01:28

passed #441494
amd64 linux
gcc:xenial:amd64

00:01:34

passed #441506
amd64 windows
msvc:windows:amd64

00:04:59

passed #441498
amd64 linux
mutexatomics:sid:amd64

00:00:59

passed #441505
amd64 linux
nolibtool:sid:amd64

00:02:01

passed #441501
amd64 linux
pkcs11:sid:amd64

00:00:59

passed #441497
amd64 linux
rwlock:sid:amd64

00:01:20

 
  Unit
passed #441519
amd64 linux
unit:asan:sid:amd64

00:04:06

passed #441523
amd64 freebsd
unit:clang:freebsd11.3:amd64

00:00:28

passed #441524
amd64 freebsd
unit:clang:freebsd12.0:amd64

00:01:09

passed #441521
amd64 linux
unit:clang:stretch:amd64

00:00:50

passed #441507
amd64 linux
unit:gcc:alpine3.10:amd64

00:02:34

passed #441518
amd64 linux
unit:gcc:bionic:amd64

00:00:51

passed #441513
amd64 linux
unit:gcc:buster:amd64

00:01:22

passed #441508
amd64 linux
unit:gcc:centos6:amd64

00:00:53

passed #441509
amd64 linux
unit:gcc:centos7:amd64

00:00:52

passed #441510
amd64 linux
unit:gcc:centos8:amd64

00:00:52

passed #441516
amd64 linux
unit:gcc:fedora30:amd64

00:01:18

passed #441511
amd64 linux
unit:gcc:jessie:amd64

00:00:29

passed #441514
amd64 linux
unit:gcc:sid:amd64

00:01:23

passed #441515
i386 linux
unit:gcc:sid:i386

00:01:48

passed #441512
amd64 linux
unit:gcc:stretch:amd64

00:00:51

passed #441517
amd64 linux
unit:gcc:xenial:amd64

00:00:53

passed #441525
amd64 linux
unit:nolibtool:sid:amd64

00:01:39

passed #441522
amd64 linux
unit:pkcs11:sid:amd64

00:01:15

passed #441520
amd64 linux
unit:rwlock:sid:amd64

00:01:17

 
  System
passed #441538
amd64 linux
system:asan:sid:amd64

00:09:21

failed #441541
amd64 freebsd
system:clang:freebsd11.3:amd64

01:10:10

failed #441542
amd64 freebsd
system:clang:freebsd12.0:amd64

01:10:10

failed #441526
amd64 linux
system:gcc:alpine3.10:amd64

01:00:01

passed #441537
amd64 linux
system:gcc:bionic:amd64

00:06:41

passed #441532
amd64 linux
system:gcc:buster:amd64

00:07:44

passed #441527
amd64 linux
system:gcc:centos6:amd64

00:07:31

passed #441528
amd64 linux
system:gcc:centos7:amd64

00:07:03

failed #441529
amd64 linux
system:gcc:centos8:amd64

00:08:20

passed #441535
amd64 linux
system:gcc:fedora30:amd64

00:08:27

failed #441530
amd64 linux
system:gcc:jessie:amd64

00:08:10

passed #441533
amd64 linux
system:gcc:sid:amd64

00:07:32

passed #441534
i386 linux
system:gcc:sid:i386

00:08:21

passed #441531
amd64 linux
system:gcc:stretch:amd64

00:06:40

passed #441536
amd64 linux
system:gcc:xenial:amd64

00:06:34

passed #441543
amd64 linux
system:nolibtool:sid:amd64

00:08:19

failed #441540
amd64 linux
system:pkcs11:sid:amd64

00:08:04

passed #441539
amd64 linux
system:rwlock:sid:amd64

00:08:29

 
  Docs
passed #441544
amd64 linux
docs:sid:amd64

00:00:58

 
  Postcheck
passed #441546
amd64 linux
cppcheck:gcc:sid:amd64

00:01:33

passed #441545
amd64 linux
scan-build:buster:amd64

00:10:34

 
Name Stage Failure
failed
system:clang:freebsd11.3:amd64 System The script exceeded the maximum execution time set for the job
E:keymgr:Fri Nov 29 06:11:05 UTC 2019
--- test-xfer ---
R:xfer:PASS
E:xfer:Fri Nov 29 06:11:06 UTC 2019
--- test-zero ---
R:zero:PASS
E:zero:Fri Nov 29 06:11:06 UTC 2019
ERROR: Failed to force-kill: os: process already finished
ERROR: Job failed: execution took longer than 1h0m0s seconds
failed
system:clang:freebsd12.0:amd64 System The script exceeded the maximum execution time set for the job
I:zero:exit status: 0
--- test-xfer ---
R:xfer:PASS
E:xfer:Fri Nov 29 06:10:24 UTC 2019
--- test-zero ---
R:zero:PASS
E:zero:Fri Nov 29 06:10:27 UTC 2019
ERROR: Failed to force-kill: os: process already finished
ERROR: Job failed: execution took longer than 1h0m0s seconds
failed
system:gcc:alpine3.10:amd64 System The script exceeded the maximum execution time set for the job
I:xfer:checking whether named calculates incoming AXFR statistics correctly
I:xfer:checking whether named calculates outgoing AXFR statistics correctly
I:xfer:exit status: 0
R:zero:PASS
E:zero:Fri Nov 29 06:11:36 UTC 2019
R:xfer:PASS
E:xfer:Fri Nov 29 06:11:37 UTC 2019
Pulling docker image gitlab/gitlab-runner-helper:x86_64-05161b14 ...
ERROR: Job failed: execution took longer than 1h0m0s seconds
failed
system:gcc:centos8:amd64 System
I:      1 FAIL
I: 95 PASS
I:The following system tests failed:
I: mkeys
make: *** [Makefile:486: test] Error 1
Uploading artifacts...
untracked: found 1454 files
Uploading artifacts to coordinator... ok
id=441529 responseStatus=201 Created token=-8g8tHyf
ERROR: Job failed: exit code 1
failed
system:gcc:jessie:amd64 System
I:      2 SKIPPED
I:The following system tests failed:
I: autosign
make: *** [test] Error 1
Makefile:484: recipe for target 'test' failed
Uploading artifacts...
untracked: found 1543 files
Uploading artifacts to coordinator... ok
id=441530 responseStatus=201 Created token=FxwDvuqi
ERROR: Job failed: exit code 1
failed
system:pkcs11:sid:amd64 System
I:      1 PKCS11ONLY
I: 2 SKIPPED
I:The following system tests failed:
I: forward
make: *** [Makefile:486: test] Error 1
Uploading artifacts...
untracked: found 1383 files
Uploading artifacts to coordinator... ok
id=441540 responseStatus=201 Created token=orLVAvP5
ERROR: Job failed: exit code 1