fixup! fixup! Replace isc_thread_key API with simple thread_local variables

Status Job ID Name Coverage
  Precheck
passed #445229
amd64 linux
🐞:sid:amd64

00:02:48

passed #445227
amd64 linux
autoreconf:sid:amd64

00:00:32

passed #445228
amd64 linux
misc:sid:amd64

00:00:18

 
  Build
passed #445242
amd64 linux
asan:sid:amd64

00:04:34

passed #445248
amd64 freebsd
clang:freebsd11.3:amd64

00:01:16

passed #445249
amd64 freebsd
clang:freebsd12.0:amd64

00:01:10

passed #445250
amd64 openbsd
clang:openbsd6.5:amd64

00:05:14

passed #445245
amd64 linux
clang:stretch:amd64

00:02:48

passed #445246
i386 linux
clang:stretch:i386

00:03:53

passed #445230
amd64 linux
gcc:alpine3.10:amd64

00:02:10

passed #445241
amd64 linux
gcc:bionic:amd64

00:02:20

passed #445236
amd64 linux
gcc:buster:amd64

00:01:49

passed #445231
amd64 linux
gcc:centos6:amd64

00:01:49

passed #445232
amd64 linux
gcc:centos7:amd64

00:01:54

passed #445233
amd64 linux
gcc:centos8:amd64

00:01:43

passed #445239
amd64 linux
gcc:fedora30:amd64

00:02:14

passed #445234
amd64 linux
gcc:jessie:amd64

00:01:54

passed #445237
amd64 linux
gcc:sid:amd64

00:03:33

passed #445238
i386 linux
gcc:sid:i386

00:02:44

passed #445235
amd64 linux
gcc:stretch:amd64

00:02:35

passed #445240
amd64 linux
gcc:xenial:amd64

00:02:30

passed #445252
amd64 windows
msvc:windows:amd64

00:02:45

passed #445244
amd64 linux
mutexatomics:sid:amd64

00:02:11

passed #445251
amd64 linux
nolibtool:sid:amd64

00:03:27

passed #445247
amd64 linux
pkcs11:sid:amd64

00:02:19

passed #445243
amd64 linux
rwlock:sid:amd64

00:02:41

 
  Unit
failed #445265
amd64 linux
unit:asan:sid:amd64

00:04:40

failed #445269
amd64 freebsd
unit:clang:freebsd11.3:amd64

00:00:27

failed #445270
amd64 freebsd
unit:clang:freebsd12.0:amd64

00:01:08

failed #445267
amd64 linux
unit:clang:stretch:amd64

00:01:02

failed #445253
amd64 linux
unit:gcc:alpine3.10:amd64

00:02:46

failed #445264
amd64 linux
unit:gcc:bionic:amd64

00:01:28

failed #445259
amd64 linux
unit:gcc:buster:amd64

00:01:03

failed #445254
amd64 linux
unit:gcc:centos6:amd64

00:01:08

failed #445255
amd64 linux
unit:gcc:centos7:amd64

00:00:38

failed #445256
amd64 linux
unit:gcc:centos8:amd64

00:01:07

failed #445262
amd64 linux
unit:gcc:fedora30:amd64

00:02:10

passed #445257
amd64 linux
unit:gcc:jessie:amd64

00:00:29

failed #445260
amd64 linux
unit:gcc:sid:amd64

00:02:00

failed #445261
i386 linux
unit:gcc:sid:i386

00:01:48

failed #445258
amd64 linux
unit:gcc:stretch:amd64

00:01:04

passed #445263
amd64 linux
unit:gcc:xenial:amd64

00:01:25

failed #445271
amd64 linux
unit:nolibtool:sid:amd64

00:01:42

failed #445268
amd64 linux
unit:pkcs11:sid:amd64

00:01:42

failed #445266
amd64 linux
unit:rwlock:sid:amd64

00:01:41

 
  System
failed #445284
amd64 linux
system:asan:sid:amd64

00:22:06

passed #445287
amd64 freebsd
system:clang:freebsd11.3:amd64

00:08:57

failed #445288
amd64 freebsd
system:clang:freebsd12.0:amd64

00:08:46

failed #445272
amd64 linux
system:gcc:alpine3.10:amd64

00:10:13

failed #445283
amd64 linux
system:gcc:bionic:amd64

00:19:06

passed #445278
amd64 linux
system:gcc:buster:amd64

00:07:39

failed #445273
amd64 linux
system:gcc:centos6:amd64

00:17:49

failed #445274
amd64 linux
system:gcc:centos7:amd64

00:18:15

failed #445275
amd64 linux
system:gcc:centos8:amd64

00:19:14

failed #445281
amd64 linux
system:gcc:fedora30:amd64

00:19:32

passed #445276
amd64 linux
system:gcc:jessie:amd64

00:07:20

failed #445279
amd64 linux
system:gcc:sid:amd64

00:19:27

failed #445280
i386 linux
system:gcc:sid:i386

00:18:24

passed #445277
amd64 linux
system:gcc:stretch:amd64

00:07:22

passed #445282
amd64 linux
system:gcc:xenial:amd64

00:06:35

failed #445289
amd64 linux
system:nolibtool:sid:amd64

00:20:27

passed #445286
amd64 linux
system:pkcs11:sid:amd64

00:08:00

failed #445285
amd64 linux
system:rwlock:sid:amd64

00:18:52

 
  Docs
passed #445290
amd64 linux
docs:sid:amd64

00:01:04

 
  Postcheck
passed #445292
amd64 linux
cppcheck:gcc:sid:amd64

00:02:20

failed #445291
amd64 linux
scan-build:buster:amd64

00:09:33

 
Name Stage Failure
failed
system:asan:sid:amd64 System
  Array cookie:            ac
Intra object redzone: bb
ASan internal: fe
Left alloca redzone: ca
Right alloca redzone: cb
Shadow gap: cc
==14135==ABORTING
=================================================================
==14173==ERROR: AddressSanitizer: stack-buffer-overflow on address 0x7fbfc2b08620 at pc 0x7fbfca484458 bp 0x7f
Job's log exceeded limit of 4194304 bytes.
failed
system:nolibtool:sid:amd64 System
I:      xfer
I: xferquota
I: zero
I: zonechecks
make: *** [Makefile:486: test] Error 1
Uploading artifacts...
untracked: found 5043 files
Uploading artifacts to coordinator... ok
id=445289 responseStatus=201 Created token=xM7aRVnL
ERROR: Job failed: exit code 1
failed
system:gcc:bionic:amd64 System
I:      xferquota
I: zero
I: zonechecks
Makefile:484: recipe for target 'test' failed
make: *** [test] Error 1
Uploading artifacts...
untracked: found 5580 files
Uploading artifacts to coordinator... ok
id=445283 responseStatus=201 Created token=FrspxyYn
ERROR: Job failed: exit code 1
failed
system:rwlock:sid:amd64 System
I:      xfer
I: xferquota
I: zero
I: zonechecks
make: *** [Makefile:486: test] Error 1
Uploading artifacts...
untracked: found 5580 files
Uploading artifacts to coordinator... ok
id=445285 responseStatus=201 Created token=osSy2Jvs
ERROR: Job failed: exit code 1
failed
system:gcc:sid:amd64 System
I:      xfer
I: xferquota
I: zero
I: zonechecks
make: *** [Makefile:486: test] Error 1
Uploading artifacts...
untracked: found 5678 files
Uploading artifacts to coordinator... ok
id=445279 responseStatus=201 Created token=B9pjdQrN
ERROR: Job failed: exit code 1
failed
system:gcc:fedora30:amd64 System
I:      xfer
I: xferquota
I: zero
I: zonechecks
make: *** [Makefile:486: test] Error 1
Uploading artifacts...
untracked: found 5600 files
Uploading artifacts to coordinator... ok
id=445281 responseStatus=201 Created token=6o5FnpTU
ERROR: Job failed: exit code 1
failed
system:gcc:centos8:amd64 System
I:      xfer
I: xferquota
I: zero
I: zonechecks
make: *** [Makefile:486: test] Error 1
Uploading artifacts...
untracked: found 5600 files
Uploading artifacts to coordinator... ok
id=445275 responseStatus=201 Created token=uhFUDebR
ERROR: Job failed: exit code 1
failed
system:gcc:sid:i386 System
I:      xfer
I: xferquota
I: zero
I: zonechecks
make: *** [Makefile:486: test] Error 1
Uploading artifacts...
untracked: found 5552 files
Uploading artifacts to coordinator... ok
id=445280 responseStatus=201 Created token=b4kzPQz-
ERROR: Job failed: exit code 1
failed
system:gcc:centos7:amd64 System
I:      xfer
I: xferquota
I: zero
I: zonechecks
make: *** [test] Error 1
Uploading artifacts...
untracked: found 5594 files
Uploading artifacts to coordinator... ok
id=445274 responseStatus=201 Created token=_sUs9q2e
ERROR: Job failed: exit code 1
failed
system:gcc:centos6:amd64 System
I:      xfer
I: xferquota
I: zero
make: *** [test] Error 1
I: zonechecks
Uploading artifacts...
untracked: found 5576 files
Uploading artifacts to coordinator... ok
id=445273 responseStatus=201 Created token=_MWKDzaK
ERROR: Job failed: exit code 1
failed
system:gcc:alpine3.10:amd64 System
I:The following system tests failed:
I: dnssec
I: dnstap
I: statschannel
make: *** [Makefile:486: test] Error 1
Uploading artifacts...
untracked: found 2984 files
Uploading artifacts to coordinator... ok
id=445272 responseStatus=201 Created token=y6jgLy8m
ERROR: Job failed: exit code 1
failed
scan-build:buster:amd64 Postcheck
make[2]: Entering directory '/builds/isc-projects/bind9/doc/tex'
make[2]: Leaving directory '/builds/isc-projects/bind9/doc/tex'
make[1]: Leaving directory '/builds/isc-projects/bind9/doc'
scan-build: 1 bug found.
scan-build: Run 'scan-view /builds/isc-projects/bind9/scan-build.reports/2019-12-02-124736-7556-1' to examine bug reports.
Uploading artifacts...
scan-build.reports/: found 6 matching files
Uploading artifacts to coordinator... ok
id=445291 responseStatus=201 Created token=13qLfKUN
ERROR: Job failed: exit code 1
failed
unit:asan:sid:amd64 Unit
Generating kyua_html/lib_ns_tests_query_test_main.html
Generating kyua_html/report.css
Generating kyua_html/index.html
Uploading artifacts...
kyua.log: found 1 matching files
kyua.results: found 1 matching files

kyua_html/: found 70 matching files

Uploading artifacts to coordinator... ok
id=445265 responseStatus=201 Created token=d8He_VBJ
ERROR: Job failed: exit code 1
failed
system:clang:freebsd12.0:amd64 System
I:      rrl
*** [test] Error code 1

make: stopped in /builds/isc-projects/bind9/bin/tests/system
Uploading artifacts...
Runtime platform arch=amd64 os=freebsd pid=54693 revision=de7731dd version=12.1.0
untracked: found 1407 files

Uploading artifacts to coordinator... ok
id=445288 responseStatus=201 Created token=bF_CR4Wj
ERROR: Job failed: exit status 1
failed
unit:nolibtool:sid:amd64 Unit
Generating kyua_html/lib_ns_tests_query_test_main.html
Generating kyua_html/report.css
Generating kyua_html/index.html
Uploading artifacts...
kyua.log: found 1 matching files
kyua.results: found 1 matching files

kyua_html/: found 70 matching files

Uploading artifacts to coordinator... ok
id=445271 responseStatus=201 Created token=KJ_Rn6ag
ERROR: Job failed: exit code 1
failed
unit:gcc:sid:amd64 Unit
Generating kyua_html/lib_ns_tests_query_test_main.html
Generating kyua_html/report.css
Generating kyua_html/index.html
Uploading artifacts...
kyua.log: found 1 matching files
kyua.results: found 1 matching files

kyua_html/: found 70 matching files

Uploading artifacts to coordinator... ok
id=445260 responseStatus=201 Created token=Kh9UAL5t
ERROR: Job failed: exit code 1
failed
unit:clang:stretch:amd64 Unit
Generating kyua_html/lib_ns_tests_query_test_main.html
Generating kyua_html/report.css
Generating kyua_html/index.html
Uploading artifacts...
kyua.log: found 1 matching files
kyua.results: found 1 matching files

kyua_html/: found 70 matching files

Uploading artifacts to coordinator... ok
id=445267 responseStatus=201 Created token=bpQdpKWa
ERROR: Job failed: exit code 1
failed
unit:gcc:alpine3.10:amd64 Unit
Generating kyua_html/lib_ns_tests_query_test_main.html
Generating kyua_html/report.css
Generating kyua_html/index.html
Uploading artifacts...
kyua.log: found 1 matching files
kyua.results: found 1 matching files

kyua_html/: found 70 matching files

Uploading artifacts to coordinator... ok
id=445253 responseStatus=201 Created token=oy7Ze33R
ERROR: Job failed: exit code 1
failed
unit:gcc:sid:i386 Unit
Generating kyua_html/lib_ns_tests_query_test_main.html
Generating kyua_html/report.css
Generating kyua_html/index.html
Uploading artifacts...
kyua.log: found 1 matching files
kyua.results: found 1 matching files

kyua_html/: found 70 matching files

Uploading artifacts to coordinator... ok
id=445261 responseStatus=201 Created token=s1K1Fsbt
ERROR: Job failed: exit code 1
failed
unit:rwlock:sid:amd64 Unit
Generating kyua_html/lib_ns_tests_query_test_main.html
Generating kyua_html/report.css
Generating kyua_html/index.html
Uploading artifacts...
kyua.log: found 1 matching files
kyua.results: found 1 matching files

kyua_html/: found 70 matching files

Uploading artifacts to coordinator... ok
id=445266 responseStatus=201 Created token=kZSviEny
ERROR: Job failed: exit code 1
failed
unit:pkcs11:sid:amd64 Unit
Generating kyua_html/lib_ns_tests_query_test_main.html
Generating kyua_html/report.css
Generating kyua_html/index.html
Uploading artifacts...
kyua.log: found 1 matching files
kyua.results: found 1 matching files

kyua_html/: found 70 matching files

Uploading artifacts to coordinator... ok
id=445268 responseStatus=201 Created token=TxMuzyBA
ERROR: Job failed: exit code 1
failed
unit:gcc:fedora30:amd64 Unit
Generating kyua_html/lib_ns_tests_query_test_main.html
Generating kyua_html/report.css
Generating kyua_html/index.html
Uploading artifacts...
kyua.log: found 1 matching files
kyua.results: found 1 matching files

kyua_html/: found 70 matching files

Uploading artifacts to coordinator... ok
id=445262 responseStatus=201 Created token=nWi_iyaL
ERROR: Job failed: exit code 1
failed
unit:gcc:bionic:amd64 Unit
Generating kyua_html/lib_ns_tests_query_test_main.html
Generating kyua_html/report.css
Generating kyua_html/index.html
Uploading artifacts...
kyua.log: found 1 matching files
kyua.results: found 1 matching files

kyua_html/: found 70 matching files

Uploading artifacts to coordinator... ok
id=445264 responseStatus=201 Created token=bnS9RzXh
ERROR: Job failed: exit code 1
failed
unit:gcc:stretch:amd64 Unit
Generating kyua_html/lib_ns_tests_query_test_main.html
Generating kyua_html/report.css
Generating kyua_html/index.html
Uploading artifacts...
kyua.log: found 1 matching files
kyua.results: found 1 matching files

kyua_html/: found 70 matching files

Uploading artifacts to coordinator... ok
id=445258 responseStatus=201 Created token=rboDz9QP
ERROR: Job failed: exit code 1
failed
unit:gcc:buster:amd64 Unit
Generating kyua_html/lib_ns_tests_query_test_main.html
Generating kyua_html/report.css
Generating kyua_html/index.html
Uploading artifacts...
kyua.log: found 1 matching files
kyua.results: found 1 matching files

kyua_html/: found 70 matching files

Uploading artifacts to coordinator... ok
id=445259 responseStatus=201 Created token=NJsg8qKM
ERROR: Job failed: exit code 1
failed
unit:gcc:centos6:amd64 Unit
Generating kyua_html/lib_ns_tests_query_test_main.html
Generating kyua_html/report.css
Generating kyua_html/index.html
Uploading artifacts...
kyua.log: found 1 matching files
kyua.results: found 1 matching files

kyua_html/: found 70 matching files

Uploading artifacts to coordinator... ok
id=445254 responseStatus=201 Created token=CriMsXuK
ERROR: Job failed: exit code 1
failed
unit:gcc:centos8:amd64 Unit
Generating kyua_html/lib_ns_tests_query_test_main.html
Generating kyua_html/report.css
Generating kyua_html/index.html
Uploading artifacts...
kyua.log: found 1 matching files
kyua.results: found 1 matching files

kyua_html/: found 70 matching files

Uploading artifacts to coordinator... ok
id=445256 responseStatus=201 Created token=kPmWbz7_
ERROR: Job failed: exit code 1
failed
unit:gcc:centos7:amd64 Unit
Generating kyua_html/lib_ns_tests_query_test_main.html
Generating kyua_html/report.css
Generating kyua_html/index.html
Uploading artifacts...
kyua.log: found 1 matching files
kyua.results: found 1 matching files

kyua_html/: found 70 matching files

Uploading artifacts to coordinator... ok
id=445255 responseStatus=201 Created token=rjohY_4t
ERROR: Job failed: exit code 1
failed
unit:clang:freebsd12.0:amd64 Unit
Generating kyua_html/report.css
Generating kyua_html/index.html
Uploading artifacts...
Runtime platform arch=amd64 os=freebsd pid=31969 revision=de7731dd version=12.1.0
kyua.log: found 1 matching files

kyua.results: found 1 matching files

kyua_html/: found 70 matching files

Uploading artifacts to coordinator... ok
id=445270 responseStatus=201 Created token=8GiRcC4G
ERROR: Job failed: exit status 1
failed
unit:clang:freebsd11.3:amd64 Unit
Generating kyua_html/report.css
Generating kyua_html/index.html
Uploading artifacts...
Runtime platform arch=amd64 os=freebsd pid=3533 revision=de7731dd version=12.1.0
kyua.log: found 1 matching files

kyua.results: found 1 matching files

kyua_html/: found 70 matching files

Uploading artifacts to coordinator... ok
id=445269 responseStatus=201 Created token=oBFP-JBM
ERROR: Job failed: exit status 1