Improved prefetch disabled test code

Using retry_quiet to test that prefetch is disabled instead of a
standard loop with sleep 1 between each iteration.
66 jobs for !2671 with 1410-intermittent-failure-in-the-resolver-test in 64 minutes and 9 seconds (queued for 5 seconds)
latest detached
Status Job ID Name Coverage
  Precheck
passed #453094
amd64 linux
🐞:sid:amd64

00:02:45

passed #453092
amd64 linux
autoreconf:sid:amd64

00:00:32

passed #453093
amd64 linux
misc:sid:amd64

00:00:17

 
  Build
passed #453107
amd64 linux
asan:sid:amd64

00:03:02

passed #453113
amd64 freebsd
clang:freebsd11.3:amd64

00:01:07

passed #453114
amd64 freebsd
clang:freebsd12.0:amd64

00:00:59

passed #453115
amd64 openbsd
clang:openbsd6.5:amd64

00:04:29

passed #453110
amd64 linux
clang:stretch:amd64

00:02:44

passed #453111
i386 linux
clang:stretch:i386

00:01:22

passed #453095
amd64 linux
gcc:alpine3.10:amd64

00:02:13

passed #453106
amd64 linux
gcc:bionic:amd64

00:02:24

passed #453101
amd64 linux
gcc:buster:amd64

00:02:14

passed #453096
amd64 linux
gcc:centos6:amd64

00:01:58

passed #453097
amd64 linux
gcc:centos7:amd64

00:02:00

passed #453098
amd64 linux
gcc:centos8:amd64

00:02:21

passed #453104
amd64 linux
gcc:fedora30:amd64

00:02:18

passed #453099
amd64 linux
gcc:jessie:amd64

00:01:22

passed #453102
amd64 linux
gcc:sid:amd64

00:02:57

passed #453103
i386 linux
gcc:sid:i386

00:01:28

passed #453100
amd64 linux
gcc:stretch:amd64

00:01:01

passed #453105
amd64 linux
gcc:xenial:amd64

00:00:59

passed #453117
amd64 windows
msvc:windows:amd64

00:02:21

passed #453109
amd64 linux
mutexatomics:sid:amd64

00:01:22

passed #453116
amd64 linux
nolibtool:sid:amd64

00:02:10

passed #453112
amd64 linux
pkcs11:sid:amd64

00:01:22

passed #453108
amd64 linux
rwlock:sid:amd64

00:01:22

 
  Unit
passed #453130
amd64 linux
unit:asan:sid:amd64

00:03:47

failed #453134
amd64 freebsd
unit:clang:freebsd11.3:amd64

00:05:10

passed #453135
amd64 freebsd
unit:clang:freebsd12.0:amd64

00:01:08

passed #453132
amd64 linux
unit:clang:stretch:amd64

00:00:53

passed #453118
amd64 linux
unit:gcc:alpine3.10:amd64

00:02:34

passed #453129
amd64 linux
unit:gcc:bionic:amd64

00:00:35

passed #453124
amd64 linux
unit:gcc:buster:amd64

00:01:17

passed #453119
amd64 linux
unit:gcc:centos6:amd64

00:00:50

passed #453120
amd64 linux
unit:gcc:centos7:amd64

00:00:52

passed #453121
amd64 linux
unit:gcc:centos8:amd64

00:00:54

passed #453127
amd64 linux
unit:gcc:fedora30:amd64

00:01:22

passed #453122
amd64 linux
unit:gcc:jessie:amd64

00:00:31

passed #453125
amd64 linux
unit:gcc:sid:amd64

00:01:16

passed #453126
i386 linux
unit:gcc:sid:i386

00:01:51

passed #453123
amd64 linux
unit:gcc:stretch:amd64

00:00:49

passed #453128
amd64 linux
unit:gcc:xenial:amd64

00:00:50

passed #453136
amd64 linux
unit:nolibtool:sid:amd64

00:01:48

passed #453133
amd64 linux
unit:pkcs11:sid:amd64

00:01:12

passed #453131
amd64 linux
unit:rwlock:sid:amd64

00:01:06

 
  System
failed #453149
amd64 linux
system:asan:sid:amd64

01:00:01

passed #453152
amd64 freebsd
system:clang:freebsd11.3:amd64

00:08:31

failed #453153
amd64 freebsd
system:clang:freebsd12.0:amd64

00:08:40

passed #453137
amd64 linux
system:gcc:alpine3.10:amd64

00:08:36

failed #453148
amd64 linux
system:gcc:bionic:amd64

00:07:29

failed #453143
amd64 linux
system:gcc:buster:amd64

01:00:01

failed #453138
amd64 linux
system:gcc:centos6:amd64

00:07:59

passed #453139
amd64 linux
system:gcc:centos7:amd64

00:07:28

passed #453140
amd64 linux
system:gcc:centos8:amd64

00:07:15

passed #453146
amd64 linux
system:gcc:fedora30:amd64

00:08:07

passed #453141
amd64 linux
system:gcc:jessie:amd64

00:07:35

failed #453144
amd64 linux
system:gcc:sid:amd64

00:07:46

passed #453145
i386 linux
system:gcc:sid:i386

00:08:17

passed #453142
amd64 linux
system:gcc:stretch:amd64

00:08:13

passed #453147
amd64 linux
system:gcc:xenial:amd64

00:07:58

passed #453154
amd64 linux
system:nolibtool:sid:amd64

00:08:13

passed #453151
amd64 linux
system:pkcs11:sid:amd64

00:08:04

passed #453150
amd64 linux
system:rwlock:sid:amd64

00:08:01

 
  Docs
passed #453155
amd64 linux
docs:sid:amd64

00:00:58

 
  Postcheck
passed #453157
amd64 linux
cppcheck:gcc:sid:amd64

00:01:55

passed #453156
amd64 linux
scan-build:buster:amd64

00:10:25

 
Name Stage Failure
failed
system:asan:sid:amd64 System The script exceeded the maximum execution time set for the job
I:xfer:checking whether dig calculates AXFR statistics correctly
I:xfer:checking whether named calculates incoming AXFR statistics correctly
I:xfer:checking whether named calculates outgoing AXFR statistics correctly
I:xfer:exit status: 0
R:xfer:PASS
E:xfer:Wed Dec 4 22:46:39 UTC 2019
I:zero:successfully completed pass 9 of 10
Pulling docker image gitlab/gitlab-runner-helper:x86_64-05161b14 ...
ERROR: Job failed: execution took longer than 1h0m0s seconds
failed
system:gcc:buster:amd64 System The script exceeded the maximum execution time set for the job
I:xfer:checking whether dig calculates AXFR statistics correctly
I:xfer:checking whether named calculates incoming AXFR statistics correctly
I:xfer:checking whether named calculates outgoing AXFR statistics correctly
I:xfer:exit status: 0
R:xfer:PASS
E:xfer:Wed Dec 4 22:44:13 UTC 2019
I:zero:successfully completed pass 9 of 10
Pulling docker image gitlab/gitlab-runner-helper:x86_64-05161b14 ...
ERROR: Job failed: execution took longer than 1h0m0s seconds
failed
system:gcc:sid:amd64 System
I:      1 FAIL
I: 96 PASS
I:The following system tests failed:
I: mkeys
make: *** [Makefile:486: test] Error 1
Uploading artifacts...
untracked: found 1508 files
Uploading artifacts to coordinator... ok
id=453144 responseStatus=201 Created token=SySXdFRQ
ERROR: Job failed: exit code 1
failed
system:gcc:bionic:amd64 System
I:     95 PASS
I:The following system tests failed:
I: dnssec
make: *** [test] Error 1
Makefile:484: recipe for target 'test' failed
Uploading artifacts...
untracked: found 2415 files
Uploading artifacts to coordinator... ok
id=453148 responseStatus=201 Created token=sEPCNZRi
ERROR: Job failed: exit code 1
failed
system:gcc:centos6:amd64 System
I:     94 PASS
I: 1 SKIPPED
I:The following system tests failed:
I: dnssec
make: *** [test] Error 1
Uploading artifacts...
untracked: found 2441 files
Uploading artifacts to coordinator... ok
id=453138 responseStatus=201 Created token=k-Azsx4Y
ERROR: Job failed: exit code 1
failed
system:clang:freebsd12.0:amd64 System
I:      dns64
*** [test] Error code 1

make: stopped in /builds/isc-projects/bind9/bin/tests/system
Uploading artifacts...
Runtime platform arch=amd64 os=freebsd pid=13115 revision=de7731dd version=12.1.0
untracked: found 1502 files

Uploading artifacts to coordinator... ok
id=453153 responseStatus=201 Created token=jjh-52cU
ERROR: Job failed: exit status 1
failed
unit:clang:freebsd11.3:amd64 Unit
Generating kyua_html/report.css
Generating kyua_html/index.html
Uploading artifacts...
Runtime platform arch=amd64 os=freebsd pid=88278 revision=de7731dd version=12.1.0
kyua.log: found 1 matching files

kyua.results: found 1 matching files

kyua_html/: found 70 matching files

Uploading artifacts to coordinator... ok
id=453134 responseStatus=201 Created token=xqn6kHQT
ERROR: Job failed: exit status 1