Fix the only occurrence of using void function as argument to return()

Status Job ID Name Coverage
  Precheck
passed #457420
amd64 linux
🐞:sid:amd64

00:03:48

passed #457418
amd64 linux
autoreconf:sid:amd64

00:00:33

passed #457419
amd64 linux
misc:sid:amd64

00:00:19

 
  Build
passed #457433
amd64 linux
asan:sid:amd64

00:01:51

passed #457439
amd64 freebsd
clang:freebsd11.3:amd64

00:01:15

passed #457440
amd64 freebsd
clang:freebsd12.0:amd64

00:01:05

passed #457441
amd64 openbsd
clang:openbsd6.5:amd64

00:05:30

passed #457436
amd64 linux
clang:stretch:amd64

00:01:48

passed #457437
i386 linux
clang:stretch:i386

00:01:45

passed #457421
amd64 linux
gcc:alpine3.10:amd64

00:01:58

passed #457432
amd64 linux
gcc:bionic:amd64

00:01:49

passed #457427
amd64 linux
gcc:buster:amd64

00:01:35

passed #457422
amd64 linux
gcc:centos6:amd64

00:02:12

passed #457423
amd64 linux
gcc:centos7:amd64

00:01:40

passed #457424
amd64 linux
gcc:centos8:amd64

00:02:26

passed #457430
amd64 linux
gcc:fedora30:amd64

00:01:50

passed #457425
amd64 linux
gcc:jessie:amd64

00:00:55

passed #457428
amd64 linux
gcc:sid:amd64

00:02:36

passed #457429
i386 linux
gcc:sid:i386

00:01:25

passed #457426
amd64 linux
gcc:stretch:amd64

00:01:43

passed #457431
amd64 linux
gcc:xenial:amd64

00:01:43

passed #457443
amd64 windows
msvc:windows:amd64

00:02:57

passed #457435
amd64 linux
mutexatomics:sid:amd64

00:01:20

passed #457442
amd64 linux
nolibtool:sid:amd64

00:02:07

passed #457438
amd64 linux
pkcs11:sid:amd64

00:00:59

passed #457434
amd64 linux
rwlock:sid:amd64

00:01:39

 
  Unit
passed #457456
amd64 linux
unit:asan:sid:amd64

00:04:51

failed #457460
amd64 freebsd
unit:clang:freebsd11.3:amd64

00:05:09

passed #457461
amd64 freebsd
unit:clang:freebsd12.0:amd64

00:01:18

passed #457458
amd64 linux
unit:clang:stretch:amd64

00:00:53

passed #457444
amd64 linux
unit:gcc:alpine3.10:amd64

00:02:54

passed #457455
amd64 linux
unit:gcc:bionic:amd64

00:00:52

passed #457450
amd64 linux
unit:gcc:buster:amd64

00:01:33

passed #457445
amd64 linux
unit:gcc:centos6:amd64

00:00:44

passed #457446
amd64 linux
unit:gcc:centos7:amd64

00:01:07

passed #457447
amd64 linux
unit:gcc:centos8:amd64

00:00:53

passed #457453
amd64 linux
unit:gcc:fedora30:amd64

00:01:29

passed #457448
amd64 linux
unit:gcc:jessie:amd64

00:00:31

passed #457451
amd64 linux
unit:gcc:sid:amd64

00:01:28

passed #457452
i386 linux
unit:gcc:sid:i386

00:01:57

passed #457449
amd64 linux
unit:gcc:stretch:amd64

00:00:54

passed #457454
amd64 linux
unit:gcc:xenial:amd64

00:01:04

passed #457462
amd64 linux
unit:nolibtool:sid:amd64

00:01:42

passed #457459
amd64 linux
unit:pkcs11:sid:amd64

00:01:17

passed #457457
amd64 linux
unit:rwlock:sid:amd64

00:01:26

 
  System
failed #457475
amd64 linux
system:asan:sid:amd64

01:00:00

failed #457478
amd64 freebsd
system:clang:freebsd11.3:amd64

00:09:45

failed #457479
amd64 freebsd
system:clang:freebsd12.0:amd64

00:09:43

passed #457463
amd64 linux
system:gcc:alpine3.10:amd64

00:09:25

passed #457474
amd64 linux
system:gcc:bionic:amd64

00:08:43

failed #457469
amd64 linux
system:gcc:buster:amd64

00:09:05

passed #457464
amd64 linux
system:gcc:centos6:amd64

00:08:34

passed #457465
amd64 linux
system:gcc:centos7:amd64

00:08:04

passed #457466
amd64 linux
system:gcc:centos8:amd64

00:09:37

passed #457472
amd64 linux
system:gcc:fedora30:amd64

00:09:20

passed #457467
amd64 linux
system:gcc:jessie:amd64

00:08:03

passed #457470
amd64 linux
system:gcc:sid:amd64

00:08:34

passed #457471
i386 linux
system:gcc:sid:i386

00:08:56

passed #457468
amd64 linux
system:gcc:stretch:amd64

00:08:05

passed #457473
amd64 linux
system:gcc:xenial:amd64

00:07:51

passed #457480
amd64 linux
system:nolibtool:sid:amd64

00:09:35

passed #457477
amd64 linux
system:pkcs11:sid:amd64

00:08:31

passed #457476
amd64 linux
system:rwlock:sid:amd64

00:08:59

 
  Docs
passed #457481
amd64 linux
docs:sid:amd64

00:00:38

 
  Postcheck
passed #457483
amd64 linux
cppcheck:gcc:sid:amd64

00:01:35

passed #457482
amd64 linux
scan-build:buster:amd64

00:12:48

 
Name Stage Failure
failed
system:asan:sid:amd64 System The script exceeded the maximum execution time set for the job
I:xfer:checking whether dig calculates AXFR statistics correctly
I:xfer:checking whether named calculates incoming AXFR statistics correctly
I:xfer:checking whether named calculates outgoing AXFR statistics correctly
I:xfer:exit status: 0
R:xfer:PASS
E:xfer:Fri Dec 6 12:50:31 UTC 2019
I:zero:successfully completed pass 7 of 10
Pulling docker image gitlab/gitlab-runner-helper:x86_64-05161b14 ...
ERROR: Job failed: execution took longer than 1h0m0s seconds
failed
system:clang:freebsd11.3:amd64 System
I:      statschannel
*** [test] Error code 1

make: stopped in /builds/isc-projects/bind9/bin/tests/system
Uploading artifacts...
Runtime platform arch=amd64 os=freebsd pid=43178 revision=de7731dd version=12.1.0
untracked: found 1488 files

Uploading artifacts to coordinator... ok
id=457478 responseStatus=201 Created token=5a5ctd9o
ERROR: Job failed: exit status 1
failed
system:clang:freebsd12.0:amd64 System
I:      reclimit
*** [test] Error code 1

make: stopped in /builds/isc-projects/bind9/bin/tests/system
Uploading artifacts...
Runtime platform arch=amd64 os=freebsd pid=37718 revision=de7731dd version=12.1.0
untracked: found 1363 files

Uploading artifacts to coordinator... ok
id=457479 responseStatus=201 Created token=3g9ziwTU
ERROR: Job failed: exit status 1
failed
system:gcc:buster:amd64 System
I:      1 FAIL
I: 95 PASS
I:The following system tests failed:
I: mkeys
make: *** [Makefile:486: test] Error 1
Uploading artifacts...
untracked: found 1421 files
Uploading artifacts to coordinator... ok
id=457469 responseStatus=201 Created token=2AHk65UC
ERROR: Job failed: exit code 1
failed
unit:clang:freebsd11.3:amd64 Unit
Generating kyua_html/report.css
Generating kyua_html/index.html
Uploading artifacts...
Runtime platform arch=amd64 os=freebsd pid=3667 revision=de7731dd version=12.1.0
kyua.log: found 1 matching files

kyua.results: found 1 matching files

kyua_html/: found 70 matching files

Uploading artifacts to coordinator... ok
id=457460 responseStatus=201 Created token=7RQqf_U3
ERROR: Job failed: exit status 1