error out if gen finds a type oclass that is greater than 65535

Status Job ID Name Coverage
  Precheck
passed #785354
amd64 linux
autoreconf

00:00:35

passed #785356
amd64 linux
clang-format

00:00:27

passed #785357
amd64 linux
coccinelle

00:03:53

passed #785355
amd64 linux
misc

00:00:20

 
  Build
passed #785373
amd64 linux
clang:asan

00:03:37

passed #785377
amd64 linux
clang:buster:amd64

00:01:08

passed #785379
amd64 libvirt
clang:freebsd11.3:amd64

00:02:02

passed #785380
amd64 libvirt
clang:freebsd12.1:amd64

00:01:46

passed #785381
amd64 libvirt
clang:openbsd6.6:amd64

00:05:12

passed #785375
amd64 linux
clang:tsan

00:01:33

passed #785358
amd64 linux
gcc:alpine3.11:amd64

00:02:28

passed #785372
amd64 linux
gcc:asan

00:01:56

passed #785371
amd64 linux
gcc:bionic:amd64

00:01:44

passed #785363
amd64 linux
gcc:buster:amd64

00:01:26

passed #785359
amd64 linux
gcc:centos6:amd64

00:02:33

passed #785360
amd64 linux
gcc:centos7:amd64

00:02:39

passed #785361
amd64 linux
gcc:centos8:amd64

00:02:30

passed #785369
amd64 linux
gcc:fedora31:amd64

00:06:24

passed #785364
amd64 linux
gcc:sid:amd64

00:01:37

passed #785366
arm64 linux
gcc:sid:arm64

00:02:50

passed #785367
i386 linux
gcc:sid:i386

00:01:33

passed #785362
amd64 linux
gcc:stretch:amd64

00:01:36

passed #785374
amd64 linux
gcc:tsan

00:07:18

passed #785368
amd64 linux
gcc:tumbleweed:amd64

00:02:13

passed #785370
amd64 linux
gcc:xenial:amd64

00:01:06

passed #785382
amd64 windows
msvc:windows:amd64

00:06:37

passed #785376
amd64 linux
mutexatomics

00:02:13

passed #785365
amd64 linux
out-of-tree

00:01:38

passed #785378
amd64 linux
pkcs11

00:01:42

 
  Unit
passed #785397
amd64 linux
unit:clang:asan

00:01:10

passed #785401
amd64 linux
unit:clang:buster:amd64

00:00:56

passed #785403
amd64 libvirt
unit:clang:freebsd11.3:amd64

00:01:04

passed #785404
amd64 libvirt
unit:clang:freebsd12.1:amd64

00:01:00

failed #785399
amd64 linux allowed to fail
unit:clang:tsan

00:02:09

passed #785383
amd64 linux
unit:gcc:alpine3.11:amd64

00:00:55

passed #785396
amd64 linux
unit:gcc:asan

00:01:08

passed #785395
amd64 linux
unit:gcc:bionic:amd64

00:00:58

passed #785388
amd64 linux
unit:gcc:buster:amd64

00:00:51

passed #785384
amd64 linux
unit:gcc:centos6:amd64

00:00:41

passed #785385
amd64 linux
unit:gcc:centos7:amd64

00:00:53

passed #785386
amd64 linux
unit:gcc:centos8:amd64

00:00:39

passed #785393
amd64 linux
unit:gcc:fedora31:amd64

00:00:53

passed #785389
amd64 linux
unit:gcc:sid:amd64

00:00:41

passed #785390
arm64 linux
unit:gcc:sid:arm64

00:01:33

passed #785391
i386 linux
unit:gcc:sid:i386

00:00:50

passed #785387
amd64 linux
unit:gcc:stretch:amd64

00:00:53

failed #785398
amd64 linux allowed to fail
unit:gcc:tsan

00:02:48

passed #785392
amd64 linux
unit:gcc:tumbleweed:amd64

00:00:51

passed #785394
amd64 linux
unit:gcc:xenial:amd64

00:00:44

passed #785400
amd64 linux
unit:mutexatomics

00:00:52

passed #785402
amd64 linux
unit:pkcs11

00:00:39

 
  System
failed #785419
amd64 linux
system:clang:asan

00:15:54

passed #785423
amd64 linux
system:clang:buster:amd64

00:12:15

passed #785425
amd64 libvirt
system:clang:freebsd11.3:amd64

00:12:36

failed #785426
amd64 libvirt
system:clang:freebsd12.1:amd64

00:12:55

failed #785421
amd64 linux allowed to fail
system:clang:tsan

00:16:32

passed #785405
amd64 linux
system:gcc:alpine3.11:amd64

00:11:58

failed #785418
amd64 linux
system:gcc:asan

00:15:30

passed #785417
amd64 linux
system:gcc:bionic:amd64

00:13:06

passed #785410
amd64 linux
system:gcc:buster:amd64

00:11:27

passed #785406
amd64 linux
system:gcc:centos6:amd64

00:11:19

passed #785407
amd64 linux
system:gcc:centos7:amd64

00:10:14

passed #785408
amd64 linux
system:gcc:centos8:amd64

00:10:20

passed #785415
amd64 linux
system:gcc:fedora31:amd64

00:12:23

passed #785411
amd64 linux
system:gcc:sid:amd64

00:11:26

passed #785412
arm64 linux
system:gcc:sid:arm64

00:13:19

passed #785413
i386 linux
system:gcc:sid:i386

00:11:04

passed #785409
amd64 linux
system:gcc:stretch:amd64

00:10:06

failed #785420
amd64 linux allowed to fail
system:gcc:tsan

00:19:50

passed #785414
amd64 linux
system:gcc:tumbleweed:amd64

00:10:49

passed #785416
amd64 linux
system:gcc:xenial:amd64

00:11:00

passed #785422
amd64 linux
system:mutexatomics

00:12:25

passed #785424
amd64 linux
system:pkcs11

00:11:37

 
  Docs
passed #785427
amd64 linux
docs

00:00:29

 
  Postcheck
passed #785429
amd64 linux
cppcheck

00:00:31

passed #785428
amd64 linux
scan-build

00:12:45

 
Name Stage Failure
failed
system:gcc:tsan System
make: *** [Makefile:441: test] Error 1
Running after script...
$ find bin -name 'tsan.*' -exec python3 util/parse_tsan.py {} \;
Uploading artifacts...
bin/tests/system/*/tsan.*: found 18 matching files
bin/tests/system/*/*/tsan.*: found 250 matching files

tsan/: found 217 matching files

Uploading artifacts to coordinator... ok
id=785420 responseStatus=201 Created token=ydNuAFLU
ERROR: Job failed: exit code 1
failed
system:clang:tsan System
make: *** [Makefile:441: test] Error 1
Running after script...
$ find bin -name 'tsan.*' -exec python3 util/parse_tsan.py {} \;
Uploading artifacts...
bin/tests/system/*/tsan.*: found 19 matching files
bin/tests/system/*/*/tsan.*: found 245 matching files

tsan/: found 213 matching files

Uploading artifacts to coordinator... ok
id=785421 responseStatus=201 Created token=eB7Fn6ab
ERROR: Job failed: exit code 1
failed
system:clang:asan System
I:      1 FAIL
I: 98 PASS
I:The following system tests failed:
I: kasp
make: *** [Makefile:441: test] Error 1
Uploading artifacts...
untracked: found 3095 files
Uploading artifacts to coordinator... ok
id=785419 responseStatus=201 Created token=zPgYfCdv
ERROR: Job failed: exit code 1
failed
system:gcc:asan System
I:      1 FAIL
I: 98 PASS
I:The following system tests failed:
I: xfer
make: *** [Makefile:441: test] Error 1
Uploading artifacts...
untracked: found 1419 files
Uploading artifacts to coordinator... ok
id=785418 responseStatus=201 Created token=4uqUvxpG
ERROR: Job failed: exit code 1
failed
system:clang:freebsd12.1:amd64 System
I:      dnstap
*** [test] Error code 1

make: stopped in /builds/isc-projects/bind9/bin/tests/system
Uploading artifacts...
Runtime platform arch=amd64 os=freebsd pid=22648 revision=4c96e5ad version=12.9.0
untracked: found 1367 files

Uploading artifacts to coordinator... ok
id=785426 responseStatus=201 Created token=hioAxPff
ERROR: Job failed: exit status 1
failed
unit:gcc:tsan Unit
$ find lib -name 'tsan.*' -exec python3 util/parse_tsan.py {} \;
Uploading artifacts...
WARNING: lib/*/tests/tsan.*: no matching files
WARNING: tsan/: no matching files
kyua.log: found 1 matching files

kyua.results: found 1 matching files

WARNING: kyua_html/: no matching files
Uploading artifacts to coordinator... ok
id=785398 responseStatus=201 Created token=6N_xjr4t
ERROR: Job failed: exit code 1
failed
unit:clang:tsan Unit
$ find lib -name 'tsan.*' -exec python3 util/parse_tsan.py {} \;
Uploading artifacts...
WARNING: lib/*/tests/tsan.*: no matching files
WARNING: tsan/: no matching files
kyua.log: found 1 matching files

kyua.results: found 1 matching files

WARNING: kyua_html/: no matching files
Uploading artifacts to coordinator... ok
id=785399 responseStatus=201 Created token=erPxgVi3
ERROR: Job failed: exit code 1