CHANGES

(cherry picked from commit 8b9e2d33)
83 jobs for !3725 with each-rndc-netmgr-pt1-v9_16 in 23 minutes and 42 seconds (queued for 8 seconds)
latest detached
Status Job ID Name Coverage
  Precheck
passed #965924
amd64 linux
autoreconf

00:00:43

passed #965926
amd64 linux
clang-format

00:01:00

passed #965927
amd64 linux
coccinelle

00:04:33

passed #966009
linux amd64
danger

00:02:01

passed #965925
amd64 linux
misc

00:00:30

failed #965928
amd64 linux
danger

00:00:24

 
  Build
passed #965943
amd64 linux
clang:asan

00:06:18

passed #965947
amd64 linux
clang:buster:amd64

00:02:37

passed #965950
amd64 libvirt
clang:freebsd11.3:amd64

00:02:21

passed #965951
amd64 libvirt
clang:freebsd12.1:amd64

00:02:28

passed #965952
amd64 libvirt
clang:openbsd6.6:amd64

00:05:01

passed #965945
amd64 linux
clang:tsan

00:03:07

passed #965929
amd64 linux
gcc:alpine3.11:amd64

00:03:27

passed #965942
amd64 linux
gcc:asan

00:05:40

passed #965941
amd64 linux
gcc:bionic:amd64

00:03:02

passed #965934
amd64 linux
gcc:buster:amd64

00:02:51

passed #965930
amd64 linux
gcc:centos6:amd64

00:02:42

passed #965931
amd64 linux
gcc:centos7:amd64

00:02:17

passed #965932
amd64 linux
gcc:centos8:amd64

00:03:28

passed #965946
amd64 linux
gcc:mutexatomics

00:02:48

passed #965936
amd64 linux
gcc:out-of-tree

00:02:18

passed #965935
amd64 linux
gcc:sid:amd64

00:03:03

passed #965937
arm64 linux
gcc:sid:arm64

00:03:24

passed #965938
i386 linux
gcc:sid:i386

00:03:29

passed #965948
amd64 linux
gcc:softhsm2.4

00:02:20

passed #965949
amd64 linux
gcc:softhsm2.6

00:02:24

passed #965933
amd64 linux
gcc:stretch:amd64

00:03:31

passed #965944
amd64 linux
gcc:tsan

00:03:43

passed #965939
amd64 linux
gcc:tumbleweed:amd64

00:03:22

passed #965940
amd64 linux
gcc:xenial:amd64

00:03:00

passed #965954
amd64 windows
msvc:windows:amd64

00:02:29

passed #965953
amd64 linux
nolibtool:sid:amd64

00:04:14

 
  Unit
passed #965968
amd64 linux
unit:clang:asan

00:02:04

passed #965972
amd64 linux
unit:clang:buster:amd64

00:01:29

passed #965975
amd64 libvirt
unit:clang:freebsd11.3:amd64

00:01:14

passed #965976
amd64 libvirt
unit:clang:freebsd12.1:amd64

00:01:13

failed #965970
amd64 linux allowed to fail
unit:clang:tsan

00:02:15

passed #965955
amd64 linux
unit:gcc:alpine3.11:amd64

00:02:20

passed #965967
amd64 linux
unit:gcc:asan

00:02:11

passed #965966
amd64 linux
unit:gcc:bionic:amd64

00:01:35

passed #965960
amd64 linux
unit:gcc:buster:amd64

00:01:22

passed #965956
amd64 linux
unit:gcc:centos6:amd64

00:00:56

passed #965957
amd64 linux
unit:gcc:centos7:amd64

00:01:32

passed #965958
amd64 linux
unit:gcc:centos8:amd64

00:01:51

passed #965971
amd64 linux
unit:gcc:mutexatomics

00:01:34

passed #965961
amd64 linux
unit:gcc:sid:amd64

00:00:52

passed #965962
arm64 linux
unit:gcc:sid:arm64

00:00:51

passed #965963
i386 linux
unit:gcc:sid:i386

00:01:52

passed #965973
amd64 linux
unit:gcc:softhsm2.4

00:01:35

passed #965974
amd64 linux
unit:gcc:softhsm2.6

00:01:36

passed #965959
amd64 linux
unit:gcc:stretch:amd64

00:00:53

failed #965969
amd64 linux allowed to fail
unit:gcc:tsan

00:02:31

passed #965964
amd64 linux
unit:gcc:tumbleweed:amd64

00:00:54

passed #965965
amd64 linux
unit:gcc:xenial:amd64

00:01:43

passed #965977
amd64 linux
unit:nolibtool:sid:amd64

00:01:03

 
  System
failed #965991
amd64 linux
system:clang:asan

00:14:04

failed #965995
amd64 linux
system:clang:buster:amd64

00:16:42

failed #965998
amd64 libvirt
system:clang:freebsd11.3:amd64

00:13:25

failed #965999
amd64 libvirt
system:clang:freebsd12.1:amd64

00:13:46

failed #965993
amd64 linux allowed to fail
system:clang:tsan

00:16:26

failed #965978
amd64 linux
system:gcc:alpine3.11:amd64

00:12:04

failed #965990
amd64 linux
system:gcc:asan

00:14:19

failed #965989
amd64 linux
system:gcc:bionic:amd64

00:13:43

failed #965983
amd64 linux
system:gcc:buster:amd64

00:14:05

failed #965979
amd64 linux
system:gcc:centos6:amd64

00:14:28

failed #965980
amd64 linux
system:gcc:centos7:amd64

00:12:12

failed #965981
amd64 linux
system:gcc:centos8:amd64

00:14:26

failed #965994
amd64 linux
system:gcc:mutexatomics

00:12:20

failed #965984
amd64 linux
system:gcc:sid:amd64

00:13:31

failed #965985
arm64 linux
system:gcc:sid:arm64

00:12:13

failed #965986
i386 linux
system:gcc:sid:i386

00:13:23

failed #965996
amd64 linux
system:gcc:softhsm2.4

00:12:23

failed #965997
amd64 linux
system:gcc:softhsm2.6

00:12:43

failed #965982
amd64 linux
system:gcc:stretch:amd64

00:18:25

failed #965992
amd64 linux allowed to fail
system:gcc:tsan

00:19:05

failed #965987
amd64 linux
system:gcc:tumbleweed:amd64

00:14:36

failed #965988
amd64 linux
system:gcc:xenial:amd64

00:13:37

failed #966000
amd64 linux
system:nolibtool:sid:amd64

00:15:02

 
  Docs
passed #966001
amd64 linux
docs

00:09:12

 
  Postcheck
passed #966005
amd64 linux
cppcheck

00:00:39

passed #966002
amd64 linux
flake8

00:01:02

passed #966003
amd64 linux
pylint

00:01:06

passed #966004
amd64 linux
scan-build

00:12:19

 
Name Stage Failure
failed
system:gcc:tsan System
Running after script...
$ find bin -name 'tsan.*' -exec python3 util/parse_tsan.py {} \;
Uploading artifacts for failed job
Uploading artifacts...
bin/tests/system/*/tsan.*: found 19 matching files

bin/tests/system/*/*/tsan.*: found 223 matching files

tsan/: found 176 matching files

Uploading artifacts to coordinator... ok
id=965992 responseStatus=201 Created token=SEVB4hc-
ERROR: Job failed: exit code 1
failed
system:gcc:stretch:amd64 System
I:      statistics
make: *** [test] Error 1
Makefile:489: recipe for target 'test' failed
Running after_script
Uploading artifacts for failed job
Uploading artifacts...
untracked: found 1427 files

Uploading artifacts to coordinator... ok
id=965982 responseStatus=201 Created token=LhfbwCfx
ERROR: Job failed: exit code 1
failed
system:clang:asan System
I:Core dumps were found for the following system tests:
I: statistics
make: *** [Makefile:491: test] Error 1
Running after_script
Uploading artifacts for failed job
Uploading artifacts...
untracked: found 1382 files

Uploading artifacts to coordinator... ok
id=965991 responseStatus=201 Created token=7WtFPvjP
ERROR: Job failed: exit code 1
failed
system:gcc:asan System
I:Core dumps were found for the following system tests:
I: statistics
make: *** [Makefile:491: test] Error 1
Running after_script
Uploading artifacts for failed job
Uploading artifacts...
untracked: found 1458 files

Uploading artifacts to coordinator... ok
id=965990 responseStatus=201 Created token=-qzerLNF
ERROR: Job failed: exit code 1
failed
system:clang:tsan System
Running after script...
$ find bin -name 'tsan.*' -exec python3 util/parse_tsan.py {} \;
Uploading artifacts for failed job
Uploading artifacts...
bin/tests/system/*/tsan.*: found 16 matching files

bin/tests/system/*/*/tsan.*: found 212 matching files

tsan/: found 177 matching files

Uploading artifacts to coordinator... ok
id=965993 responseStatus=201 Created token=wwyyzirZ
ERROR: Job failed: exit code 1
failed
system:nolibtool:sid:amd64 System
I:Assertion failures were detected for the following system tests:
I: statistics
make: *** [Makefile:491: test] Error 1
Running after_script
Uploading artifacts for failed job
Uploading artifacts...
untracked: found 841 files

Uploading artifacts to coordinator... ok
id=966000 responseStatus=201 Created token=sU_ssoau
ERROR: Job failed: exit code 1
failed
system:clang:buster:amd64 System
I:Assertion failures were detected for the following system tests:
I: statistics
make: *** [Makefile:491: test] Error 1
Running after_script
Uploading artifacts for failed job
Uploading artifacts...
untracked: found 4101 files

Uploading artifacts to coordinator... ok
id=965995 responseStatus=201 Created token=LkH7ZnzD
ERROR: Job failed: exit code 1
failed
system:gcc:tumbleweed:amd64 System
I:Assertion failures were detected for the following system tests:
I: statistics
make: *** [Makefile:491: test] Error 1
Running after_script
Uploading artifacts for failed job
Uploading artifacts...
untracked: found 1383 files

Uploading artifacts to coordinator... ok
id=965987 responseStatus=201 Created token=BUnYcTNx
ERROR: Job failed: exit code 1
failed
system:gcc:centos8:amd64 System
I:Assertion failures were detected for the following system tests:
I: statistics
make: *** [Makefile:491: test] Error 1
Running after_script
Uploading artifacts for failed job
Uploading artifacts...
untracked: found 1412 files

Uploading artifacts to coordinator... ok
id=965981 responseStatus=201 Created token=z37ozuoV
ERROR: Job failed: exit code 1
failed
system:gcc:centos6:amd64 System
I:Assertion failures were detected for the following system tests:
I: statistics
make: *** [test] Error 1
Running after_script
Uploading artifacts for failed job
Uploading artifacts...
untracked: found 1412 files

Uploading artifacts to coordinator... ok
id=965979 responseStatus=201 Created token=ShYTQWJo
ERROR: Job failed: exit code 1
failed
system:gcc:sid:i386 System
I:Assertion failures were detected for the following system tests:
I: statistics
make: *** [Makefile:491: test] Error 1
Running after_script
Uploading artifacts for failed job
Uploading artifacts...
untracked: found 1360 files

Uploading artifacts to coordinator... ok
id=965986 responseStatus=201 Created token=kn7bm1cr
ERROR: Job failed: exit code 1
failed
system:gcc:buster:amd64 System
I:Assertion failures were detected for the following system tests:
I: statistics
make: *** [Makefile:491: test] Error 1
Running after_script
Uploading artifacts for failed job
Uploading artifacts...
untracked: found 1382 files

Uploading artifacts to coordinator... ok
id=965983 responseStatus=201 Created token=BCqAUkSs
ERROR: Job failed: exit code 1
failed
system:gcc:bionic:amd64 System
I:      statistics
make: *** [test] Error 1
Makefile:489: recipe for target 'test' failed
Running after_script
Uploading artifacts for failed job
Uploading artifacts...
untracked: found 1378 files

Uploading artifacts to coordinator... ok
id=965989 responseStatus=201 Created token=B91rwf8e
ERROR: Job failed: exit code 1
failed
system:gcc:xenial:amd64 System
I:      statistics
make: *** [test] Error 1
Makefile:489: recipe for target 'test' failed
Running after_script
Uploading artifacts for failed job
Uploading artifacts...
untracked: found 1407 files

Uploading artifacts to coordinator... ok
id=965988 responseStatus=201 Created token=U6b9za64
ERROR: Job failed: exit code 1
failed
system:gcc:sid:amd64 System
I:Assertion failures were detected for the following system tests:
I: statistics
make: *** [Makefile:491: test] Error 1
Running after_script
Uploading artifacts for failed job
Uploading artifacts...
untracked: found 1395 files

Uploading artifacts to coordinator... ok
id=965984 responseStatus=201 Created token=p7Hg5H48
ERROR: Job failed: exit code 1
failed
system:clang:freebsd12.1:amd64 System

make: stopped in /builds/isc-projects/bind9/bin/tests/system
Running after_script
Uploading artifacts for failed job
Uploading artifacts...
Runtime platform
arch=amd64 os=freebsd pid=43778 revision=21cb397c version=13.0.1
untracked: found 1394 files

Uploading artifacts to coordinator... ok
id=965999 responseStatus=201 Created token=gE61pxEj
ERROR: Job failed: exit status 1
failed
system:clang:freebsd11.3:amd64 System

make: stopped in /builds/isc-projects/bind9/bin/tests/system
Running after_script
Uploading artifacts for failed job
Uploading artifacts...
Runtime platform
arch=amd64 os=freebsd pid=41326 revision=21cb397c version=13.0.1
untracked: found 1383 files

Uploading artifacts to coordinator... ok
id=965998 responseStatus=201 Created token=Rcg7ozwF
ERROR: Job failed: exit status 1
failed
system:gcc:sid:arm64 System
I:Assertion failures were detected for the following system tests:
I: statistics
make: *** [Makefile:491: test] Error 1
Running after_script
Uploading artifacts for failed job
Uploading artifacts...
untracked: found 1383 files

Uploading artifacts to coordinator... ok
id=965985 responseStatus=201 Created token=HFjgZEn3
ERROR: Job failed: exit code 1
failed
system:gcc:alpine3.11:amd64 System
I:Assertion failures were detected for the following system tests:
I: statistics
make: *** [Makefile:491: test] Error 1
Running after_script
Uploading artifacts for failed job
Uploading artifacts...
untracked: found 1429 files

Uploading artifacts to coordinator... ok
id=965978 responseStatus=201 Created token=xrpMVEeF
ERROR: Job failed: exit code 1
failed
system:gcc:softhsm2.6 System
I:Assertion failures were detected for the following system tests:
I: statistics
make: *** [Makefile:491: test] Error 1
Running after_script
Uploading artifacts for failed job
Uploading artifacts...
untracked: found 1460 files

Uploading artifacts to coordinator... ok
id=965997 responseStatus=201 Created token=rkZsHxBE
ERROR: Job failed: exit code 1
failed
system:gcc:mutexatomics System
I:Assertion failures were detected for the following system tests:
I: statistics
make: *** [Makefile:491: test] Error 1
Running after_script
Uploading artifacts for failed job
Uploading artifacts...
untracked: found 1382 files

Uploading artifacts to coordinator... ok
id=965994 responseStatus=201 Created token=cjsidHDw
ERROR: Job failed: exit code 1
failed
system:gcc:softhsm2.4 System
I:Assertion failures were detected for the following system tests:
I: statistics
make: *** [Makefile:491: test] Error 1
Running after_script
Uploading artifacts for failed job
Uploading artifacts...
untracked: found 1496 files

Uploading artifacts to coordinator... ok
id=965996 responseStatus=201 Created token=sbKj-m8g
ERROR: Job failed: exit code 1
failed
system:gcc:centos7:amd64 System
I:Assertion failures were detected for the following system tests:
I: statistics
make: *** [test] Error 1
Running after_script
Uploading artifacts for failed job
Uploading artifacts...
untracked: found 1425 files

Uploading artifacts to coordinator... ok
id=965980 responseStatus=201 Created token=xoxUUjsQ
ERROR: Job failed: exit code 1
failed
unit:gcc:tsan Unit
Uploading artifacts for failed job
Uploading artifacts...
lib/*/tests/tsan.*: found 3 matching files

tsan/: found 33 matching files

kyua.log: found 1 matching files

kyua.results: found 1 matching files

kyua_html/: found 70 matching files

Uploading artifacts to coordinator... ok
id=965969 responseStatus=201 Created token=--8_5JQm
ERROR: Job failed: exit code 1
failed
unit:clang:tsan Unit
Uploading artifacts for failed job
Uploading artifacts...
lib/*/tests/tsan.*: found 1 matching files

tsan/: found 10 matching files

kyua.log: found 1 matching files

kyua.results: found 1 matching files

kyua_html/: found 70 matching files

Uploading artifacts to coordinator... ok
id=965970 responseStatus=201 Created token=YpuRqMNn
ERROR: Job failed: exit code 1