fixup! Add isc_mem_calloc, use uv_replace_allocators

79 jobs for !3826 with ondrej/uv-replace-allocator in 76 minutes and 31 seconds (queued for 7 seconds)
latest detached
Status Job ID Name Coverage
  Autoconf
passed #1017403
amd64 linux
autoreconf

00:00:17

 
  Precheck
failed #1017405
amd64 linux
clang-format

00:00:15

passed #1017406
amd64 linux
coccinelle

00:02:48

failed #1017407
amd64 linux
danger

00:00:13

passed #1017404
amd64 linux
misc

00:00:15

 
  Build
failed #1017422
amd64 linux
clang:asan

00:01:38

failed #1017426
amd64 linux
clang:buster:amd64

00:00:53

failed #1017429
amd64 libvirt
clang:freebsd11.4:amd64

00:00:43

failed #1017430
amd64 libvirt
clang:freebsd12.1:amd64

00:00:43

failed #1017431
amd64 libvirt
clang:openbsd6.7:amd64

00:01:47

failed #1017424
amd64 linux
clang:tsan

00:01:05

failed #1017408
amd64 linux
gcc:alpine3.12:amd64

00:00:50

failed #1017421
amd64 linux
gcc:asan

00:01:25

failed #1017413
amd64 linux
gcc:buster:amd64

00:00:51

failed #1017409
amd64 linux
gcc:centos6:amd64

00:00:43

failed #1017410
amd64 linux
gcc:centos7:amd64

00:00:46

failed #1017411
amd64 linux
gcc:centos8:amd64

00:00:50

failed #1017420
amd64 linux
gcc:focal:amd64

00:00:39

failed #1017425
amd64 linux
gcc:mutexatomics

00:00:51

failed #1017415
amd64 linux
gcc:out-of-tree

00:00:40

passed #1017414
amd64 linux
gcc:sid:amd64

00:01:05

passed #1017416
arm64 linux
gcc:sid:arm64

00:16:01

passed #1017417
i386 linux
gcc:sid:i386

00:00:59

failed #1017427
amd64 linux
gcc:softhsm2.4

00:00:50

passed #1017428
amd64 linux
gcc:softhsm2.6

00:00:56

failed #1017412
amd64 linux
gcc:stretch:amd64

00:00:55

failed #1017423
amd64 linux
gcc:tsan

00:01:01

failed #1017418
amd64 linux
gcc:tumbleweed:amd64

00:00:46

failed #1017419
amd64 linux
gcc:xenial:amd64

00:00:49

failed #1017432
amd64 windows
msvc:windows:amd64

00:00:36

 
  Unit
skipped #1017446
amd64 linux
unit:clang:asan
skipped #1017450
amd64 linux
unit:clang:buster:amd64
skipped #1017453
amd64 libvirt
unit:clang:freebsd11.4:amd64
skipped #1017454
amd64 libvirt
unit:clang:freebsd12.1:amd64
skipped #1017448
amd64 linux allowed to fail
unit:clang:tsan
skipped #1017433
amd64 linux
unit:gcc:alpine3.12:amd64
skipped #1017445
amd64 linux
unit:gcc:asan
skipped #1017438
amd64 linux
unit:gcc:buster:amd64
skipped #1017434
amd64 linux
unit:gcc:centos6:amd64
skipped #1017435
amd64 linux
unit:gcc:centos7:amd64
skipped #1017436
amd64 linux
unit:gcc:centos8:amd64
skipped #1017444
amd64 linux
unit:gcc:focal:amd64
skipped #1017449
amd64 linux
unit:gcc:mutexatomics
failed #1017439
amd64 linux
unit:gcc:sid:amd64

00:00:55

failed #1017440
arm64 linux
unit:gcc:sid:arm64

00:43:18

failed #1017441
i386 linux
unit:gcc:sid:i386

00:00:56

skipped #1017451
amd64 linux
unit:gcc:softhsm2.4
failed #1017452
amd64 linux
unit:gcc:softhsm2.6

00:00:56

skipped #1017437
amd64 linux
unit:gcc:stretch:amd64
skipped #1017447
amd64 linux allowed to fail
unit:gcc:tsan
skipped #1017442
amd64 linux
unit:gcc:tumbleweed:amd64
skipped #1017443
amd64 linux
unit:gcc:xenial:amd64
 
  System
skipped #1017468
amd64 linux
system:clang:asan
skipped #1017472
amd64 linux
system:clang:buster:amd64
skipped #1017475
amd64 libvirt
system:clang:freebsd11.4:amd64
skipped #1017476
amd64 libvirt
system:clang:freebsd12.1:amd64
skipped #1017470
amd64 linux allowed to fail
system:clang:tsan
skipped #1017455
amd64 linux
system:gcc:alpine3.12:amd64
skipped #1017467
amd64 linux
system:gcc:asan
skipped #1017460
amd64 linux
system:gcc:buster:amd64
skipped #1017456
amd64 linux
system:gcc:centos6:amd64
skipped #1017457
amd64 linux
system:gcc:centos7:amd64
skipped #1017458
amd64 linux
system:gcc:centos8:amd64
skipped #1017466
amd64 linux
system:gcc:focal:amd64
skipped #1017471
amd64 linux
system:gcc:mutexatomics
failed #1017461
amd64 linux
system:gcc:sid:amd64

00:17:04

failed #1017462
arm64 linux
system:gcc:sid:arm64

01:00:02

failed #1017463
i386 linux
system:gcc:sid:i386

00:16:34

skipped #1017473
amd64 linux
system:gcc:softhsm2.4
failed #1017474
amd64 linux
system:gcc:softhsm2.6

00:17:31

skipped #1017459
amd64 linux
system:gcc:stretch:amd64
skipped #1017469
amd64 linux allowed to fail
system:gcc:tsan
skipped #1017464
amd64 linux
system:gcc:tumbleweed:amd64
skipped #1017465
amd64 linux
system:gcc:xenial:amd64
 
  Docs
passed #1017477
amd64 linux
docs

00:00:42

 
  Postcheck
passed #1017481
amd64 linux
cppcheck

00:00:43

passed #1017478
amd64 linux
flake8

00:00:23

passed #1017479
amd64 linux
pylint

00:00:23

passed #1017480
amd64 linux
scan-build

00:03:32

 
Name Stage Failure
failed
system:gcc:sid:arm64 System The script exceeded the maximum execution time set for the job
I:kasp:check rndc dnssec -status output for step2.algorithm-roll.kasp (805)
[New LWP 30392]
Running after_script
WARNING: Failed to inspect build container 1b2f52047f302b869ff5f566e0273b1e67690f8672965c73dc1c762d89cd4a60 context deadline exceeded (docker_command.go:78:0s)
Authenticating with credentials from job payload (GitLab Registry)
Pulling docker image registry.gitlab.isc.org/isc-projects/images/bind9:debian-sid-arm64 ...
Uploading artifacts for failed job
Pulling docker image gitlab/gitlab-runner-helper:arm64-6fbc7474 ...
ERROR: Job failed: execution took longer than 1h0m0s seconds
failed
unit:gcc:sid:arm64 Unit
make[2]: Leaving directory '/builds/isc-projects/bind9/bin'
make[1]: Leaving directory '/builds/isc-projects/bind9/bin'
make: *** [Makefile:640: unit-recursive] Error 1
make: Target 'unit' not remade because of errors.
Uploading artifacts for failed job
Uploading artifacts...
untracked: found 1572 files

Uploading artifacts as "archive" to coordinator... ok
id=1017440 responseStatus=201 Created token=82DS8uh8
ERROR: Job failed: exit code 1
failed
system:gcc:softhsm2.6 System
R:shutdown:FAIL
E:shutdown:2020-07-10T07:48:39+0000
FAIL shutdown (exit status: 1)

Uploading artifacts for failed job
Uploading artifacts...
untracked: found 13966 files

Uploading artifacts as "archive" to coordinator... ok
id=1017474 responseStatus=201 Created token=mzSfohXX
ERROR: Job failed: exit code 1
failed
system:gcc:sid:amd64 System
R:shutdown:FAIL
E:shutdown:2020-07-10T07:48:51+0000
FAIL shutdown (exit status: 1)

Uploading artifacts for failed job
Uploading artifacts...
untracked: found 13801 files

Uploading artifacts as "archive" to coordinator... ok
id=1017461 responseStatus=201 Created token=n8ue9Uio
ERROR: Job failed: exit code 1
failed
system:gcc:sid:i386 System
R:shutdown:FAIL
E:shutdown:2020-07-10T07:49:11+0000
FAIL shutdown (exit status: 1)

Uploading artifacts for failed job
Uploading artifacts...
untracked: found 13774 files

Uploading artifacts as "archive" to coordinator... ok
id=1017463 responseStatus=201 Created token=MRW_gPZa
ERROR: Job failed: exit code 1
failed
unit:gcc:sid:amd64 Unit
make[2]: Leaving directory '/builds/isc-projects/bind9/bin'
make[1]: Leaving directory '/builds/isc-projects/bind9/bin'
make: *** [Makefile:640: unit-recursive] Error 1
make: Target 'unit' not remade because of errors.
Uploading artifacts for failed job
Uploading artifacts...
untracked: found 1591 files

Uploading artifacts as "archive" to coordinator... ok
id=1017439 responseStatus=201 Created token=npqDryEZ
ERROR: Job failed: exit code 1
failed
unit:gcc:softhsm2.6 Unit
make[2]: Leaving directory '/builds/isc-projects/bind9/bin'
make[1]: Leaving directory '/builds/isc-projects/bind9/bin'
make: *** [Makefile:640: unit-recursive] Error 1
make: Target 'unit' not remade because of errors.
Uploading artifacts for failed job
Uploading artifacts...
untracked: found 1651 files

Uploading artifacts as "archive" to coordinator... ok
id=1017452 responseStatus=201 Created token=Xh_HyehQ
ERROR: Job failed: exit code 1
failed
unit:gcc:sid:i386 Unit
make[2]: Leaving directory '/builds/isc-projects/bind9/bin'
make[1]: Leaving directory '/builds/isc-projects/bind9/bin'
make: *** [Makefile:640: unit-recursive] Error 1
make: Target 'unit' not remade because of errors.
Uploading artifacts for failed job
Uploading artifacts...
untracked: found 1572 files

Uploading artifacts as "archive" to coordinator... ok
id=1017441 responseStatus=201 Created token=CLp1T1NP
ERROR: Job failed: exit code 1
failed
clang:openbsd6.7:amd64 Build
Error target(s) unaccounted for: all-recursive all 
`all' not remade because of errors.
Errors while building
*** Error 1 in target 'all-recursive', line 665 of Makefile (continuing)
Error target(s) unaccounted for: all-recursive
Errors while building
*** Error 2 in target 'all', line 544 of Makefile (continuing)
Error target(s) unaccounted for: all
ERROR: Job failed: exit status 1
failed
clang:asan Build
make[3]: Nothing to be done for 'all-am'.
make[3]: Leaving directory '/builds/isc-projects/bind9/bin'
make[2]: *** [Makefile:450: all-recursive] Error 1
make[2]: Target 'all' not remade because of errors.
make[2]: Leaving directory '/builds/isc-projects/bind9/bin'
make[1]: *** [Makefile:640: all-recursive] Error 1
make[1]: Leaving directory '/builds/isc-projects/bind9'
make: *** [Makefile:544: all] Error 2
ERROR: Job failed: exit code 1
failed
gcc:asan Build
make[3]: Nothing to be done for 'all-am'.
make[3]: Leaving directory '/builds/isc-projects/bind9/bin'
make[2]: Leaving directory '/builds/isc-projects/bind9/bin'
make[2]: *** [Makefile:450: all-recursive] Error 1
make[2]: Target 'all' not remade because of errors.
make[1]: Leaving directory '/builds/isc-projects/bind9'
make[1]: *** [Makefile:640: all-recursive] Error 1
make: *** [Makefile:544: all] Error 2
ERROR: Job failed: exit code 1
failed
gcc:tsan Build
make[3]: Nothing to be done for 'all-am'.
make[3]: Leaving directory '/builds/isc-projects/bind9/bin'
make[2]: Leaving directory '/builds/isc-projects/bind9/bin'
make[2]: *** [Makefile:450: all-recursive] Error 1
make[2]: Target 'all' not remade because of errors.
make[1]: Leaving directory '/builds/isc-projects/bind9'
make[1]: *** [Makefile:640: all-recursive] Error 1
make: *** [Makefile:544: all] Error 2
ERROR: Job failed: exit code 1
failed
clang:tsan Build
make[3]: Nothing to be done for 'all-am'.
make[3]: Leaving directory '/builds/isc-projects/bind9/bin'
make[2]: *** [Makefile:450: all-recursive] Error 1
make[2]: Target 'all' not remade because of errors.
make[2]: Leaving directory '/builds/isc-projects/bind9/bin'
make[1]: Leaving directory '/builds/isc-projects/bind9'
make[1]: *** [Makefile:640: all-recursive] Error 1
make: *** [Makefile:544: all] Error 2
ERROR: Job failed: exit code 1
failed
gcc:stretch:amd64 Build
make[2]: Target 'all' not remade because of errors.
Makefile:450: recipe for target 'all-recursive' failed
make[2]: Leaving directory '/builds/isc-projects/bind9/bin'
make[1]: *** [all-recursive] Error 1
Makefile:640: recipe for target 'all-recursive' failed
make[1]: Leaving directory '/builds/isc-projects/bind9'
make: *** [all] Error 2
Makefile:544: recipe for target 'all' failed
ERROR: Job failed: exit code 1
failed
clang:buster:amd64 Build
make[3]: Nothing to be done for 'all-am'.
make[3]: Leaving directory '/builds/isc-projects/bind9/bin'
make[2]: *** [Makefile:450: all-recursive] Error 1
make[2]: Target 'all' not remade because of errors.
make[2]: Leaving directory '/builds/isc-projects/bind9/bin'
make[1]: Leaving directory '/builds/isc-projects/bind9'
make[1]: *** [Makefile:640: all-recursive] Error 1
make: *** [Makefile:544: all] Error 2
ERROR: Job failed: exit code 1
failed
clang:freebsd12.1:amd64 Build

make[2]: stopped in /builds/isc-projects/bind9/bin
*** [all-recursive] Error code 1

make[1]: stopped in /builds/isc-projects/bind9
*** [all] Error code 1

make: stopped in /builds/isc-projects/bind9
ERROR: Job failed: exit status 1
failed
gcc:xenial:amd64 Build
make[2]: *** [all-recursive] Error 1
make[2]: Target 'all' not remade because of errors.
make[2]: Leaving directory '/builds/isc-projects/bind9/bin'
Makefile:640: recipe for target 'all-recursive' failed
make[1]: Leaving directory '/builds/isc-projects/bind9'
make[1]: *** [all-recursive] Error 1
Makefile:544: recipe for target 'all' failed
make: *** [all] Error 2
ERROR: Job failed: exit code 1
failed
clang:freebsd11.4:amd64 Build

make[2]: stopped in /builds/isc-projects/bind9/bin
*** [all-recursive] Error code 1

make[1]: stopped in /builds/isc-projects/bind9
*** [all] Error code 1

make: stopped in /builds/isc-projects/bind9
ERROR: Job failed: exit status 1
failed
gcc:softhsm2.4 Build
make[3]: Nothing to be done for 'all-am'.
make[3]: Leaving directory '/builds/isc-projects/bind9/bin'
make[2]: *** [Makefile:450: all-recursive] Error 1
make[2]: Target 'all' not remade because of errors.
make[2]: Leaving directory '/builds/isc-projects/bind9/bin'
make[1]: *** [Makefile:640: all-recursive] Error 1
make: *** [Makefile:544: all] Error 2
make[1]: Leaving directory '/builds/isc-projects/bind9'
ERROR: Job failed: exit code 1
failed
gcc:mutexatomics Build
make[3]: Nothing to be done for 'all-am'.
make[3]: Leaving directory '/builds/isc-projects/bind9/bin'
make[2]: *** [Makefile:450: all-recursive] Error 1
make[2]: Target 'all' not remade because of errors.
make[2]: Leaving directory '/builds/isc-projects/bind9/bin'
make[1]: *** [Makefile:640: all-recursive] Error 1
make[1]: Leaving directory '/builds/isc-projects/bind9'
make: *** [Makefile:544: all] Error 2
ERROR: Job failed: exit code 1
failed
gcc:buster:amd64 Build
make[3]: Nothing to be done for 'all-am'.
make[3]: Leaving directory '/builds/isc-projects/bind9/bin'
make[2]: *** [Makefile:450: all-recursive] Error 1
make[2]: Target 'all' not remade because of errors.
make[2]: Leaving directory '/builds/isc-projects/bind9/bin'
make[1]: Leaving directory '/builds/isc-projects/bind9'
make[1]: *** [Makefile:640: all-recursive] Error 1
make: *** [Makefile:544: all] Error 2
ERROR: Job failed: exit code 1
failed
gcc:tumbleweed:amd64 Build
make[3]: Nothing to be done for 'all-am'.
make[3]: Leaving directory '/builds/isc-projects/bind9/bin'
make[2]: *** [Makefile:450: all-recursive] Error 1
make[2]: Target 'all' not remade because of errors.
make[2]: Leaving directory '/builds/isc-projects/bind9/bin'
make[1]: *** [Makefile:640: all-recursive] Error 1
make[1]: Leaving directory '/builds/isc-projects/bind9'
make: *** [Makefile:544: all] Error 2
ERROR: Job failed: exit code 1
failed
gcc:centos8:amd64 Build
make[3]: Nothing to be done for 'all-am'.
make[3]: Leaving directory '/builds/isc-projects/bind9/bin'
make[2]: Leaving directory '/builds/isc-projects/bind9/bin'
make[2]: *** [Makefile:450: all-recursive] Error 1
make[2]: Target 'all' not remade because of errors.
make[1]: Leaving directory '/builds/isc-projects/bind9'
make[1]: *** [Makefile:640: all-recursive] Error 1
make: *** [Makefile:544: all] Error 2
ERROR: Job failed: exit code 1
failed
gcc:alpine3.12:amd64 Build
make[3]: Nothing to be done for 'all-am'.
make[3]: Leaving directory '/builds/isc-projects/bind9/bin'
make[2]: Leaving directory '/builds/isc-projects/bind9/bin'
make[2]: *** [Makefile:450: all-recursive] Error 1
make[2]: Target 'all' not remade because of errors.
make[1]: *** [Makefile:640: all-recursive] Error 1
make[1]: Leaving directory '/builds/isc-projects/bind9'
make: *** [Makefile:544: all] Error 2
ERROR: Job failed: exit code 1
failed
gcc:centos7:amd64 Build
make[3]: Nothing to be done for `all-am'.
make[3]: Leaving directory `/builds/isc-projects/bind9/bin'
make[2]: *** [all-recursive] Error 1
make[2]: Target `all' not remade because of errors.
make[2]: Leaving directory `/builds/isc-projects/bind9/bin'
make[1]: *** [all-recursive] Error 1
make[1]: Leaving directory `/builds/isc-projects/bind9'
make: *** [all] Error 2
ERROR: Job failed: exit code 1
failed
gcc:focal:amd64 Build
make[3]: Nothing to be done for 'all-am'.
make[3]: Leaving directory '/builds/isc-projects/bind9/bin'
make[2]: *** [Makefile:450: all-recursive] Error 1
make[2]: Target 'all' not remade because of errors.
make[2]: Leaving directory '/builds/isc-projects/bind9/bin'
make[1]: *** [Makefile:640: all-recursive] Error 1
make[1]: Leaving directory '/builds/isc-projects/bind9'
make: *** [Makefile:544: all] Error 2
ERROR: Job failed: exit code 1
failed
gcc:centos6:amd64 Build
make[3]: Nothing to be done for `all-am'.
make[3]: Leaving directory `/builds/isc-projects/bind9/bin'
make[2]: *** [all-recursive] Error 1
make[2]: Target `all' not remade because of errors.
make[2]: Leaving directory `/builds/isc-projects/bind9/bin'
make[1]: *** [all-recursive] Error 1
make[1]: Leaving directory `/builds/isc-projects/bind9'
make: *** [all] Error 2
ERROR: Job failed: exit code 1
failed
gcc:out-of-tree Build
make[3]: Nothing to be done for 'all-am'.
make[3]: Leaving directory '/builds/isc-projects/bind9/workspace/bin'
make[2]: *** [Makefile:450: all-recursive] Error 1
make[2]: Target 'all' not remade because of errors.
make[2]: Leaving directory '/builds/isc-projects/bind9/workspace/bin'
make[1]: *** [Makefile:640: all-recursive] Error 1
make[1]: Leaving directory '/builds/isc-projects/bind9/workspace'
make: *** [Makefile:544: all] Error 2
ERROR: Job failed: exit code 1
failed
msvc:windows:amd64 Build
GO version:   go1.13.5
Built: 2020-01-23T09:17:10+0000
OS/Arch: windows/amd64
Uploading artifacts...
Runtime platform
arch=amd64 os=windows pid=13772 revision=003fe500 version=12.7.1
untracked: found 266 files

WARNING: Failed to load system CertPool: crypto/x509: system root pool is not available on Windows
Uploading artifacts to coordinator... ok
id=1017432 responseStatus=201 Created token=51BgsbZh
ERROR: Job failed: exit status 1
failed
clang-format Precheck

Skipping Git submodules setup
Executing "step_script" stage of the job script
$ if [ -r .clang-format ]; then "${CLANG_FORMAT}" -i -style=file $(git ls-files '*.c' '*.h'); fi
$ if test "$(git status --porcelain | grep -Ev '\?\?' | wc -l)" -gt "0"; then git status --short; exit 1; fi
M lib/isc/include/isc/mem.h
M lib/isc/include/isc/util.h
M lib/isc/mem.c
ERROR: Job failed: exit code 1
failed
danger Precheck

* [new branch] main -> origin/main



Failing the build, there are 4 fails.
Feedback: https://gitlab.isc.org/isc-projects/bind9/merge_requests/3826#note_146305

ERROR: Job failed: exit code 1