Add missing win32 symbol defs

79 jobs for !4197 with 46-add-curly-braces-v9_11 in 9 minutes and 55 seconds (queued for 15 seconds)
latest detached
Status Job ID Name Coverage
  Precheck
passed #1188901
amd64 linux
autoreconf

00:00:15

passed #1188903
amd64 linux
clang-format

00:00:20

passed #1188904
amd64 linux
coccinelle

00:01:17

failed #1188905
amd64 linux
danger

00:00:15

failed #1188902
amd64 linux
misc

00:00:15

 
  Build
failed #1188920
amd64 linux
clang:asan

00:03:47

failed #1188924
amd64 linux
clang:buster:amd64

00:01:50

failed #1188926
amd64 libvirt
clang:freebsd11:amd64

00:01:46

failed #1188927
amd64 libvirt
clang:freebsd12:amd64

00:01:40

failed #1188928
amd64 libvirt
clang:openbsd:amd64

00:03:21

failed #1188922
amd64 linux
clang:tsan

00:02:05

failed #1188906
amd64 linux
gcc:alpine3.12:amd64

00:01:38

failed #1188919
amd64 linux
gcc:asan

00:02:59

failed #1188911
amd64 linux
gcc:buster:amd64

00:01:35

passed #1188907
amd64 linux
gcc:centos6:amd64

00:01:34

failed #1188908
amd64 linux
gcc:centos7:amd64

00:01:28

failed #1188909
amd64 linux
gcc:centos8:amd64

00:01:37

failed #1188916
amd64 linux
gcc:fedora32:amd64

00:01:34

failed #1188918
amd64 linux
gcc:focal:amd64

00:01:31

failed #1188923
amd64 linux
gcc:mutexatomics

00:01:35

failed #1188913
amd64 linux
gcc:out-of-tree

00:01:27

failed #1188925
amd64 linux
gcc:pkcs11

00:00:40

failed #1188912
amd64 linux
gcc:sid:amd64

00:02:06

failed #1188914
i386 linux
gcc:sid:i386

00:01:39

failed #1188910
amd64 linux
gcc:stretch:amd64

00:01:50

failed #1188921
amd64 linux
gcc:tsan

00:01:48

failed #1188915
amd64 linux
gcc:tumbleweed:amd64

00:01:29

failed #1188917
amd64 linux
gcc:xenial:amd64

00:01:50

failed #1188930
amd64 windows
msvc:windows:amd64

00:00:23

failed #1188929
amd64 linux
nolibtool:sid:amd64

00:01:25

 
  Unit
skipped #1188944
amd64 linux
unit:clang:asan
skipped #1188948
amd64 linux
unit:clang:buster:amd64
skipped #1188950
amd64 libvirt
unit:clang:freebsd11:amd64
skipped #1188951
amd64 libvirt
unit:clang:freebsd12:amd64
skipped #1188946
amd64 linux
unit:clang:tsan
skipped #1188931
amd64 linux
unit:gcc:alpine3.12:amd64
skipped #1188943
amd64 linux
unit:gcc:asan
skipped #1188936
amd64 linux
unit:gcc:buster:amd64
passed #1188932
amd64 linux
unit:gcc:centos6:amd64

00:00:37

skipped #1188933
amd64 linux
unit:gcc:centos7:amd64
skipped #1188934
amd64 linux
unit:gcc:centos8:amd64
skipped #1188940
amd64 linux
unit:gcc:fedora32:amd64
skipped #1188942
amd64 linux
unit:gcc:focal:amd64
skipped #1188947
amd64 linux
unit:gcc:mutexatomics
skipped #1188949
amd64 linux
unit:gcc:pkcs11
skipped #1188937
amd64 linux
unit:gcc:sid:amd64
skipped #1188938
i386 linux
unit:gcc:sid:i386
skipped #1188935
amd64 linux
unit:gcc:stretch:amd64
skipped #1188945
amd64 linux
unit:gcc:tsan
skipped #1188939
amd64 linux
unit:gcc:tumbleweed:amd64
skipped #1188941
amd64 linux
unit:gcc:xenial:amd64
skipped #1188952
amd64 linux
unit:nolibtool:sid:amd64
 
  System
skipped #1188966
amd64 linux
system:clang:asan
skipped #1188970
amd64 linux
system:clang:buster:amd64
skipped #1188972
amd64 libvirt
system:clang:freebsd11:amd64
skipped #1188973
amd64 libvirt
system:clang:freebsd12:amd64
skipped #1188968
amd64 linux allowed to fail
system:clang:tsan
skipped #1188953
amd64 linux
system:gcc:alpine3.12:amd64
skipped #1188965
amd64 linux
system:gcc:asan
skipped #1188958
amd64 linux
system:gcc:buster:amd64
passed #1188954
amd64 linux
system:gcc:centos6:amd64

00:07:59

skipped #1188955
amd64 linux
system:gcc:centos7:amd64
skipped #1188956
amd64 linux
system:gcc:centos8:amd64
skipped #1188962
amd64 linux
system:gcc:fedora32:amd64
skipped #1188964
amd64 linux
system:gcc:focal:amd64
skipped #1188969
amd64 linux
system:gcc:mutexatomics
skipped #1188971
amd64 linux
system:gcc:pkcs11
skipped #1188959
amd64 linux
system:gcc:sid:amd64
skipped #1188960
i386 linux
system:gcc:sid:i386
skipped #1188957
amd64 linux
system:gcc:stretch:amd64
skipped #1188967
amd64 linux allowed to fail
system:gcc:tsan
skipped #1188961
amd64 linux
system:gcc:tumbleweed:amd64
skipped #1188963
amd64 linux
system:gcc:xenial:amd64
skipped #1188974
amd64 linux
system:nolibtool:sid:amd64
 
  Docs
passed #1188975
amd64 linux
docs

00:00:24

 
  Postcheck
passed #1188979
amd64 linux
cppcheck

00:00:28

passed #1188976
amd64 linux
flake8

00:00:20

passed #1188977
amd64 linux
pylint

00:00:21

passed #1188978
amd64 linux
scan-build

00:08:11

 
Name Stage Failure
failed
clang:asan Build
make[2]: *** [Makefile:473: nsupdate.lo] Error 1
make[2]: Target 'all' not remade because of errors.
make[1]: *** [Makefile:79: subdirs] Error 1
make[1]: Target 'all' not remade because of errors.
make[1]: Leaving directory '/builds/isc-projects/bind9/bin'
make: *** [Makefile:88: subdirs] Error 1
make: Target 'all' not remade because of errors.
Cleaning up file based variables
ERROR: Job failed: exit code 1
failed
clang:openbsd:amd64 Build
Error target(s) unaccounted for: subdirs testdirs all 
`all' not remade because of errors.
Errors while building
*** Error 1 in target 'subdirs', line 93 of Makefile (continuing)
Error target(s) unaccounted for: subdirs testdirs all
`all' not remade because of errors.
Cleaning up file based variables
Unsupported run stage 'cleanup_file_variables'
ERROR: Job failed: exit status 1
failed
gcc:asan Build
make[2]: Target 'all' not remade because of errors.
make[2]: Leaving directory '/builds/isc-projects/bind9/bin/nsupdate'
make[1]: *** [Makefile:79: subdirs] Error 1
make[1]: Target 'all' not remade because of errors.
make[1]: Leaving directory '/builds/isc-projects/bind9/bin'
make: *** [Makefile:88: subdirs] Error 1
make: Target 'all' not remade because of errors.
Cleaning up file based variables
ERROR: Job failed: exit code 1
failed
gcc:sid:amd64 Build
make[2]: *** [Makefile:473: nsupdate.lo] Error 1
make[2]: Target 'all' not remade because of errors.
make[1]: *** [Makefile:79: subdirs] Error 1
make[1]: Target 'all' not remade because of errors.
make[1]: Leaving directory '/builds/isc-projects/bind9/bin'
make: *** [Makefile:88: subdirs] Error 1
make: Target 'all' not remade because of errors.
Cleaning up file based variables
ERROR: Job failed: exit code 1
failed
clang:tsan Build
make[2]: *** [Makefile:473: nsupdate.lo] Error 1
make[2]: Target 'all' not remade because of errors.
make[1]: Leaving directory '/builds/isc-projects/bind9/bin'
make[1]: *** [Makefile:79: subdirs] Error 1
make[1]: Target 'all' not remade because of errors.
make: *** [Makefile:88: subdirs] Error 1
make: Target 'all' not remade because of errors.
Cleaning up file based variables
ERROR: Job failed: exit code 1
failed
clang:freebsd11:amd64 Build
*** [subdirs] Error code 1

make[1]: stopped in /builds/isc-projects/bind9/bin
*** [subdirs] Error code 1

make: stopped in /builds/isc-projects/bind9
Cleaning up file based variables
Unsupported run stage 'cleanup_file_variables'
ERROR: Job failed: exit status 1
failed
gcc:tsan Build
make[2]: *** [Makefile:473: nsupdate.lo] Error 1
make[2]: Target 'all' not remade because of errors.
make[1]: Leaving directory '/builds/isc-projects/bind9/bin'
make[1]: *** [Makefile:79: subdirs] Error 1
make[1]: Target 'all' not remade because of errors.
make: *** [Makefile:88: subdirs] Error 1
make: Target 'all' not remade because of errors.
Cleaning up file based variables
ERROR: Job failed: exit code 1
failed
gcc:xenial:amd64 Build
Makefile:79: recipe for target 'subdirs' failed
make[1]: Leaving directory '/builds/isc-projects/bind9/bin'
make[1]: *** [subdirs] Error 1
make[1]: Target 'all' not remade because of errors.
Makefile:88: recipe for target 'subdirs' failed
make: *** [subdirs] Error 1
make: Target 'all' not remade because of errors.
Cleaning up file based variables
ERROR: Job failed: exit code 1
failed
clang:freebsd12:amd64 Build
*** [subdirs] Error code 1

make[1]: stopped in /builds/isc-projects/bind9/bin
*** [subdirs] Error code 1

make: stopped in /builds/isc-projects/bind9
Cleaning up file based variables
Unsupported run stage 'cleanup_file_variables'
ERROR: Job failed: exit status 1
failed
clang:buster:amd64 Build
make[2]: Target 'all' not remade because of errors.
make[2]: Leaving directory '/builds/isc-projects/bind9/bin/nsupdate'
make[1]: *** [Makefile:79: subdirs] Error 1
make[1]: Target 'all' not remade because of errors.
make[1]: Leaving directory '/builds/isc-projects/bind9/bin'
make: *** [Makefile:88: subdirs] Error 1
make: Target 'all' not remade because of errors.
Cleaning up file based variables
ERROR: Job failed: exit code 1
failed
gcc:stretch:amd64 Build
Makefile:79: recipe for target 'subdirs' failed
make[1]: Leaving directory '/builds/isc-projects/bind9/bin'
make[1]: *** [subdirs] Error 1
make[1]: Target 'all' not remade because of errors.
make: *** [subdirs] Error 1
make: Target 'all' not remade because of errors.
Makefile:88: recipe for target 'subdirs' failed
Cleaning up file based variables
ERROR: Job failed: exit code 1
failed
gcc:sid:i386 Build
make[2]: *** [Makefile:473: nsupdate.lo] Error 1
make[2]: Target 'all' not remade because of errors.
make[1]: *** [Makefile:79: subdirs] Error 1
make[1]: Target 'all' not remade because of errors.
make[1]: Leaving directory '/builds/isc-projects/bind9/bin'
make: *** [Makefile:88: subdirs] Error 1
make: Target 'all' not remade because of errors.
Cleaning up file based variables
ERROR: Job failed: exit code 1
failed
gcc:fedora32:amd64 Build
make[2]: Target 'all' not remade because of errors.
make[2]: Leaving directory '/builds/isc-projects/bind9/bin/nsupdate'
make[1]: Leaving directory '/builds/isc-projects/bind9/bin'
make[1]: *** [Makefile:79: subdirs] Error 1
make[1]: Target 'all' not remade because of errors.
make: *** [Makefile:88: subdirs] Error 1
make: Target 'all' not remade because of errors.
Cleaning up file based variables
ERROR: Job failed: exit code 1
failed
gcc:centos8:amd64 Build
make[2]: *** [Makefile:473: nsupdate.lo] Error 1
make[2]: Target 'all' not remade because of errors.
make[1]: Leaving directory '/builds/isc-projects/bind9/bin'
make[1]: *** [Makefile:79: subdirs] Error 1
make[1]: Target 'all' not remade because of errors.
make: *** [Makefile:88: subdirs] Error 1
make: Target 'all' not remade because of errors.
Cleaning up file based variables
ERROR: Job failed: exit code 1
failed
gcc:alpine3.12:amd64 Build
make[2]: Target 'all' not remade because of errors.
make[2]: Leaving directory '/builds/isc-projects/bind9/bin/nsupdate'
make[1]: *** [Makefile:79: subdirs] Error 1
make[1]: Target 'all' not remade because of errors.
make[1]: Leaving directory '/builds/isc-projects/bind9/bin'
make: *** [Makefile:88: subdirs] Error 1
make: Target 'all' not remade because of errors.
Cleaning up file based variables
ERROR: Job failed: exit code 1
failed
gcc:mutexatomics Build
make[2]: Target 'all' not remade because of errors.
make[2]: Leaving directory '/builds/isc-projects/bind9/bin/nsupdate'
make[1]: Leaving directory '/builds/isc-projects/bind9/bin'
make[1]: *** [Makefile:79: subdirs] Error 1
make[1]: Target 'all' not remade because of errors.
make: *** [Makefile:88: subdirs] Error 1
make: Target 'all' not remade because of errors.
Cleaning up file based variables
ERROR: Job failed: exit code 1
failed
gcc:buster:amd64 Build
make[2]: *** [Makefile:473: nsupdate.lo] Error 1
make[2]: Target 'all' not remade because of errors.
make[1]: *** [Makefile:79: subdirs] Error 1
make[1]: Target 'all' not remade because of errors.
make[1]: Leaving directory '/builds/isc-projects/bind9/bin'
make: *** [Makefile:88: subdirs] Error 1
make: Target 'all' not remade because of errors.
Cleaning up file based variables
ERROR: Job failed: exit code 1
failed
gcc:focal:amd64 Build
make[2]: Target 'all' not remade because of errors.
make[2]: Leaving directory '/builds/isc-projects/bind9/bin/nsupdate'
make[1]: *** [Makefile:79: subdirs] Error 1
make[1]: Target 'all' not remade because of errors.
make[1]: Leaving directory '/builds/isc-projects/bind9/bin'
make: *** [Makefile:88: subdirs] Error 1
make: Target 'all' not remade because of errors.
Cleaning up file based variables
ERROR: Job failed: exit code 1
failed
nolibtool:sid:amd64 Build
make[2]: Target 'all' not remade because of errors.
make[2]: Leaving directory '/builds/isc-projects/bind9/bin/nsupdate'
make[1]: Leaving directory '/builds/isc-projects/bind9/bin'
make[1]: *** [Makefile:79: subdirs] Error 1
make[1]: Target 'all' not remade because of errors.
make: *** [Makefile:88: subdirs] Error 1
make: Target 'all' not remade because of errors.
Cleaning up file based variables
ERROR: Job failed: exit code 1
failed
gcc:tumbleweed:amd64 Build
make[2]: *** [Makefile:473: nsupdate.lo] Error 1
make[2]: Target 'all' not remade because of errors.
make[1]: *** [Makefile:79: subdirs] Error 1
make[1]: Target 'all' not remade because of errors.
make[1]: Leaving directory '/builds/isc-projects/bind9/bin'
make: *** [Makefile:88: subdirs] Error 1
make: Target 'all' not remade because of errors.
Cleaning up file based variables
ERROR: Job failed: exit code 1
failed
gcc:centos7:amd64 Build
make[2]: Target `all' not remade because of errors.
make[2]: Leaving directory `/builds/isc-projects/bind9/bin/nsupdate'
make[1]: Leaving directory `/builds/isc-projects/bind9/bin'
make[1]: *** [subdirs] Error 1
make[1]: Target `all' not remade because of errors.
make: *** [subdirs] Error 1
make: Target `all' not remade because of errors.
Cleaning up file based variables
ERROR: Job failed: exit code 1
failed
gcc:out-of-tree Build
make[2]: *** [Makefile:473: nsupdate.lo] Error 1
make[2]: Target 'all' not remade because of errors.
make[1]: Leaving directory '/builds/isc-projects/bind9/workspace/bin'
make[1]: *** [Makefile:79: subdirs] Error 1
make[1]: Target 'all' not remade because of errors.
make: *** [Makefile:88: subdirs] Error 1
make: Target 'all' not remade because of errors.
Cleaning up file based variables
ERROR: Job failed: exit code 1
failed
gcc:pkcs11 Build
make[2]: Target 'all' not remade because of errors.
make[2]: Leaving directory '/builds/isc-projects/bind9/lib/isc'
make[1]: *** [Makefile:82: subdirs] Error 1
make[1]: Target 'all' not remade because of errors.
make[1]: Leaving directory '/builds/isc-projects/bind9/lib'
make: *** [Makefile:88: subdirs] Error 1
make: Target 'all' not remade because of errors.
Cleaning up file based variables
ERROR: Job failed: exit code 1
failed
msvc:windows:amd64 Build
         c:\builds\isc-projects\bind9\lib\isc\win32\socket.c(675): error C2065: 'ISCConnectEx': undeclared identifier [C:\builds\isc-projects\bind9\lib\isc\win32\libisc.vcxproj]
c:\builds\isc-projects\bind9\lib\isc\win32\socket.c(676): error C2065: 'ISCConnectEx': undeclared identifier [C:\builds\isc-projects\bind9\lib\isc\win32\libisc.vcxproj]
c:\builds\isc-projects\bind9\lib\isc\win32\socket.c(680): error C2065: 'ISCAcceptEx': undeclared identifier [C:\builds\isc-projects\bind9\lib\isc\win32\libisc.vcxproj]

0 Warning(s)
63 Error(s)

Time Elapsed 00:00:10.54
ERROR: Job failed: exit status 1
failed
misc Precheck
 M lib/dns/compress.c
?? checklibs.out
Uploading artifacts for failed job
Uploading artifacts...
WARNING: util/newcopyrights: no matching files
checklibs.out: found 1 matching files and directories

Uploading artifacts as "archive" to coordinator... ok
id=1188902 responseStatus=201 Created token=RoqpzPZv
Cleaning up file based variables
ERROR: Job failed: exit code 1
failed
danger Precheck
 * [new branch]      v9_11      -> origin/v9_11



Failing the build, there is 1 fail.
Feedback: https://gitlab.isc.org/isc-projects/bind9/merge_requests/4197#note_166360

Cleaning up file based variables
ERROR: Job failed: exit code 1