Disable all the asserts on counters in the netmgr_test.c for now

(cherry picked from commit 88bb10cfab544c00c7bed36c078cab8811084495)
79 jobs for !4293 with 2221-create-unit-tests-for-netmgr-v9_16 in 16 minutes and 33 seconds (queued for 8 seconds)
latest detached
Status Job ID Name Coverage
  Precheck
passed #1241411
amd64 linux
autoreconf

00:00:16

passed #1241413
amd64 linux
clang-format

00:00:18

passed #1241414
amd64 linux
coccinelle

00:03:39

failed #1241415
amd64 linux
danger

00:00:14

passed #1241412
amd64 linux
misc

00:00:14

 
  Build
passed #1241429
amd64 linux
clang:asan

00:03:45

passed #1241433
amd64 linux
clang:buster:amd64

00:01:47

passed #1241436
amd64 libvirt
clang:freebsd11:amd64

00:01:50

failed #1241437
amd64 libvirt
clang:freebsd12:amd64

00:00:53

passed #1241438
amd64 libvirt
clang:openbsd:amd64

00:03:45

passed #1241431
amd64 linux
clang:tsan

00:02:05

failed #1241416
amd64 linux
gcc:alpine3.12:amd64

00:00:35

passed #1241428
amd64 linux
gcc:asan

00:03:12

passed #1241421
amd64 linux
gcc:buster:amd64

00:01:28

failed #1241417
amd64 linux
gcc:centos6:amd64

00:00:34

failed #1241418
amd64 linux
gcc:centos7:amd64

00:00:34

failed #1241419
amd64 linux
gcc:centos8:amd64

00:00:37

failed #1241427
amd64 linux
gcc:focal:amd64

00:00:40

passed #1241432
amd64 linux
gcc:mutexatomics

00:01:32

passed #1241423
amd64 linux
gcc:out-of-tree

00:01:24

failed #1241422
amd64 linux
gcc:sid:amd64

00:00:42

failed #1241424
i386 linux
gcc:sid:i386

00:00:38

passed #1241434
amd64 linux
gcc:softhsm2.4

00:01:31

failed #1241435
amd64 linux
gcc:softhsm2.6

00:01:04

passed #1241420
amd64 linux
gcc:stretch:amd64

00:01:49

passed #1241430
amd64 linux
gcc:tsan

00:01:52

failed #1241425
amd64 linux
gcc:tumbleweed:amd64

00:00:36

passed #1241426
amd64 linux
gcc:xenial:amd64

00:01:41

passed #1241440
amd64 windows
msvc:windows:amd64

00:03:01

passed #1241439
amd64 linux
nolibtool:sid:amd64

00:02:42

 
  Unit
passed #1241453
amd64 linux
unit:clang:asan

00:01:04

passed #1241457
amd64 linux
unit:clang:buster:amd64

00:00:42

passed #1241460
amd64 libvirt
unit:clang:freebsd11:amd64

00:01:14

skipped #1241461
amd64 libvirt
unit:clang:freebsd12:amd64
passed #1241455
amd64 linux
unit:clang:tsan

00:01:45

skipped #1241441
amd64 linux
unit:gcc:alpine3.12:amd64
passed #1241452
amd64 linux
unit:gcc:asan

00:01:04

passed #1241446
amd64 linux
unit:gcc:buster:amd64

00:00:49

skipped #1241442
amd64 linux
unit:gcc:centos6:amd64
skipped #1241443
amd64 linux
unit:gcc:centos7:amd64
skipped #1241444
amd64 linux
unit:gcc:centos8:amd64
skipped #1241451
amd64 linux
unit:gcc:focal:amd64
passed #1241456
amd64 linux
unit:gcc:mutexatomics

00:00:49

skipped #1241447
amd64 linux
unit:gcc:sid:amd64
skipped #1241448
i386 linux
unit:gcc:sid:i386
passed #1241458
amd64 linux
unit:gcc:softhsm2.4

00:00:45

skipped #1241459
amd64 linux
unit:gcc:softhsm2.6
passed #1241445
amd64 linux
unit:gcc:stretch:amd64

00:00:44

passed #1241454
amd64 linux
unit:gcc:tsan

00:01:44

skipped #1241449
amd64 linux
unit:gcc:tumbleweed:amd64
passed #1241450
amd64 linux
unit:gcc:xenial:amd64

00:00:41

passed #1241462
amd64 linux
unit:nolibtool:sid:amd64

00:01:15

 
  System
passed #1241475
amd64 linux
system:clang:asan

00:12:07

passed #1241479
amd64 linux
system:clang:buster:amd64

00:10:38

passed #1241482
amd64 libvirt
system:clang:freebsd11:amd64

00:10:50

skipped #1241483
amd64 libvirt
system:clang:freebsd12:amd64
passed #1241477
amd64 linux
system:clang:tsan

00:13:48

skipped #1241463
amd64 linux
system:gcc:alpine3.12:amd64
passed #1241474
amd64 linux
system:gcc:asan

00:12:35

passed #1241468
amd64 linux
system:gcc:buster:amd64

00:10:50

skipped #1241464
amd64 linux
system:gcc:centos6:amd64
skipped #1241465
amd64 linux
system:gcc:centos7:amd64
skipped #1241466
amd64 linux
system:gcc:centos8:amd64
skipped #1241473
amd64 linux
system:gcc:focal:amd64
passed #1241478
amd64 linux
system:gcc:mutexatomics

00:10:19

skipped #1241469
amd64 linux
system:gcc:sid:amd64
skipped #1241470
i386 linux
system:gcc:sid:i386
passed #1241480
amd64 linux
system:gcc:softhsm2.4

00:10:38

skipped #1241481
amd64 linux
system:gcc:softhsm2.6
passed #1241467
amd64 linux
system:gcc:stretch:amd64

00:10:34

passed #1241476
amd64 linux
system:gcc:tsan

00:14:10

skipped #1241471
amd64 linux
system:gcc:tumbleweed:amd64
passed #1241472
amd64 linux
system:gcc:xenial:amd64

00:09:35

passed #1241484
amd64 linux
system:nolibtool:sid:amd64

00:11:57

 
  Docs
passed #1241485
amd64 linux
docs

00:02:06

 
  Postcheck
passed #1241489
amd64 linux
cppcheck

00:00:21

passed #1241486
amd64 linux
flake8

00:00:20

passed #1241487
amd64 linux
pylint

00:00:23

passed #1241488
amd64 linux
scan-build

00:08:58

 
Name Stage Failure
failed
clang:freebsd12:amd64 Build
*** [subdirs] Error code 1

make[1]: stopped in /builds/isc-projects/bind9/lib
*** [subdirs] Error code 1

make: stopped in /builds/isc-projects/bind9
Cleaning up file based variables
Unsupported run stage 'cleanup_file_variables'
ERROR: Job failed: exit status 1
failed
gcc:softhsm2.6 Build
make[2]: Target 'all' not remade because of errors.
make[2]: Leaving directory '/builds/isc-projects/bind9/lib/isc'
make[1]: *** [Makefile:84: subdirs] Error 1
make[1]: Leaving directory '/builds/isc-projects/bind9/lib'
make[1]: Target 'all' not remade because of errors.
make: *** [Makefile:89: subdirs] Error 1
make: Target 'all' not remade because of errors.
Cleaning up file based variables
ERROR: Job failed: exit code 1
failed
gcc:focal:amd64 Build
make[2]: *** [Makefile:225: testdirs] Error 1
make[2]: Target 'all' not remade because of errors.
make[1]: *** [Makefile:84: subdirs] Error 1
make[1]: Target 'all' not remade because of errors.
make[1]: Leaving directory '/builds/isc-projects/bind9/lib'
make: *** [Makefile:89: subdirs] Error 1
make: Target 'all' not remade because of errors.
Cleaning up file based variables
ERROR: Job failed: exit code 1
failed
gcc:sid:amd64 Build
make[2]: *** [Makefile:225: testdirs] Error 1
make[2]: Target 'all' not remade because of errors.
make[1]: *** [Makefile:84: subdirs] Error 1
make[1]: Target 'all' not remade because of errors.
make[1]: Leaving directory '/builds/isc-projects/bind9/lib'
make: *** [Makefile:89: subdirs] Error 1
make: Target 'all' not remade because of errors.
Cleaning up file based variables
ERROR: Job failed: exit code 1
failed
gcc:alpine3.12:amd64 Build
make[2]: Target 'all' not remade because of errors.
make[2]: Leaving directory '/builds/isc-projects/bind9/lib/isc'
make[1]: Leaving directory '/builds/isc-projects/bind9/lib'
make[1]: *** [Makefile:84: subdirs] Error 1
make[1]: Target 'all' not remade because of errors.
make: *** [Makefile:89: subdirs] Error 1
make: Target 'all' not remade because of errors.
Cleaning up file based variables
ERROR: Job failed: exit code 1
failed
gcc:sid:i386 Build
make[2]: Target 'all' not remade because of errors.
make[2]: Leaving directory '/builds/isc-projects/bind9/lib/isc'
make[1]: *** [Makefile:84: subdirs] Error 1
make[1]: Target 'all' not remade because of errors.
make[1]: Leaving directory '/builds/isc-projects/bind9/lib'
make: *** [Makefile:89: subdirs] Error 1
make: Target 'all' not remade because of errors.
Cleaning up file based variables
ERROR: Job failed: exit code 1
failed
gcc:tumbleweed:amd64 Build
make[2]: *** [Makefile:225: testdirs] Error 1
make[2]: Target 'all' not remade because of errors.
make[1]: *** [Makefile:84: subdirs] Error 1
make[1]: Target 'all' not remade because of errors.
make[1]: Leaving directory '/builds/isc-projects/bind9/lib'
make: *** [Makefile:89: subdirs] Error 1
make: Target 'all' not remade because of errors.
Cleaning up file based variables
ERROR: Job failed: exit code 1
failed
gcc:centos8:amd64 Build
make[2]: Target 'all' not remade because of errors.
make[2]: Leaving directory '/builds/isc-projects/bind9/lib/isc'
make[1]: *** [Makefile:84: subdirs] Error 1
make[1]: Target 'all' not remade because of errors.
make[1]: Leaving directory '/builds/isc-projects/bind9/lib'
make: *** [Makefile:89: subdirs] Error 1
make: Target 'all' not remade because of errors.
Cleaning up file based variables
ERROR: Job failed: exit code 1
failed
gcc:centos7:amd64 Build
make[2]: Target `all' not remade because of errors.
make[2]: Leaving directory `/builds/isc-projects/bind9/lib/isc'
make[1]: *** [subdirs] Error 1
make[1]: Target `all' not remade because of errors.
make[1]: Leaving directory `/builds/isc-projects/bind9/lib'
make: *** [subdirs] Error 1
make: Target `all' not remade because of errors.
Cleaning up file based variables
ERROR: Job failed: exit code 1
failed
gcc:centos6:amd64 Build
make[2]: Target `all' not remade because of errors.
make[2]: Leaving directory `/builds/isc-projects/bind9/lib/isc'
make[1]: *** [subdirs] Error 1
make[1]: Target `all' not remade because of errors.
make[1]: Leaving directory `/builds/isc-projects/bind9/lib'
make: *** [subdirs] Error 1
make: Target `all' not remade because of errors.
Cleaning up file based variables
ERROR: Job failed: exit code 1
failed
danger Precheck
 * [new branch]      v9_16      -> origin/v9_16



Failing the build, there is 1 fail.
Feedback: https://gitlab.isc.org/isc-projects/bind9/merge_requests/4293#note_172176

Cleaning up file based variables
ERROR: Job failed: exit code 1