fix a typo in rpz test

"tcp-only" was not being tested correctly in the RPZ system test
because the option to the "digcmd" function that causes queries to
be sent via TCP was misspelled in one case, and was being interpreted
as a query name.

the "ckresult" function has also been changed to be case sensitive
for consistency with "digcmd".

(cherry picked from commit 78af071c)
81 jobs for !4321 with each-rpz-test-typo-v9_16 in 17 minutes and 23 seconds (queued for 7 seconds)
detached
Status Job ID Name Coverage
  Precheck
passed #1256426
amd64 linux
autoreconf

00:00:16

passed #1256428
amd64 linux
clang-format

00:00:18

passed #1256429
amd64 linux
coccinelle

00:03:33

passed #1256506
linux amd64
danger

00:00:13

passed #1256427
amd64 linux
misc

00:00:15

failed #1256430
amd64 linux
danger

00:00:14

 
  Build
passed #1256444
amd64 linux
clang:asan

00:03:50

passed #1256448
amd64 linux
clang:buster:amd64

00:01:51

passed #1256451
amd64 libvirt
clang:freebsd11:amd64

00:01:56

passed #1256452
amd64 libvirt
clang:freebsd12:amd64

00:01:43

passed #1256453
amd64 libvirt
clang:openbsd:amd64

00:03:54

passed #1256446
amd64 linux
clang:tsan

00:02:17

passed #1256431
amd64 linux
gcc:alpine3.12:amd64

00:01:40

passed #1256443
amd64 linux
gcc:asan

00:03:30

passed #1256436
amd64 linux
gcc:buster:amd64

00:01:36

passed #1256432
amd64 linux
gcc:centos6:amd64

00:01:29

passed #1256433
amd64 linux
gcc:centos7:amd64

00:01:35

passed #1256434
amd64 linux
gcc:centos8:amd64

00:01:35

passed #1256442
amd64 linux
gcc:focal:amd64

00:01:27

passed #1256447
amd64 linux
gcc:mutexatomics

00:01:36

passed #1256438
amd64 linux
gcc:out-of-tree

00:01:36

passed #1256437
amd64 linux
gcc:sid:amd64

00:02:21

passed #1256439
i386 linux
gcc:sid:i386

00:01:41

passed #1256449
amd64 linux
gcc:softhsm2.4

00:01:41

passed #1256450
amd64 linux
gcc:softhsm2.6

00:01:44

passed #1256435
amd64 linux
gcc:stretch:amd64

00:01:52

passed #1256445
amd64 linux
gcc:tsan

00:02:01

passed #1256440
amd64 linux
gcc:tumbleweed:amd64

00:01:34

passed #1256441
amd64 linux
gcc:xenial:amd64

00:01:36

passed #1256455
amd64 windows
msvc:windows:amd64

00:02:21

passed #1256454
amd64 linux
nolibtool:sid:amd64

00:02:06

 
  Unit
passed #1256468
amd64 linux
unit:clang:asan

00:00:52

passed #1256472
amd64 linux
unit:clang:buster:amd64

00:00:36

passed #1256475
amd64 libvirt
unit:clang:freebsd11:amd64

00:01:07

passed #1256476
amd64 libvirt
unit:clang:freebsd12:amd64

00:01:06

passed #1256470
amd64 linux
unit:clang:tsan

00:01:33

passed #1256456
amd64 linux
unit:gcc:alpine3.12:amd64

00:00:39

passed #1256467
amd64 linux
unit:gcc:asan

00:00:53

passed #1256461
amd64 linux
unit:gcc:buster:amd64

00:00:54

passed #1256457
amd64 linux
unit:gcc:centos6:amd64

00:00:38

passed #1256458
amd64 linux
unit:gcc:centos7:amd64

00:00:40

passed #1256459
amd64 linux
unit:gcc:centos8:amd64

00:00:42

passed #1256466
amd64 linux
unit:gcc:focal:amd64

00:00:40

passed #1256471
amd64 linux
unit:gcc:mutexatomics

00:00:38

passed #1256462
amd64 linux
unit:gcc:sid:amd64

00:00:37

passed #1256463
i386 linux
unit:gcc:sid:i386

00:00:48

passed #1256473
amd64 linux
unit:gcc:softhsm2.4

00:00:38

passed #1256474
amd64 linux
unit:gcc:softhsm2.6

00:00:41

passed #1256460
amd64 linux
unit:gcc:stretch:amd64

00:00:41

passed #1256469
amd64 linux
unit:gcc:tsan

00:01:48

passed #1256464
amd64 linux
unit:gcc:tumbleweed:amd64

00:00:42

passed #1256465
amd64 linux
unit:gcc:xenial:amd64

00:00:37

passed #1256477
amd64 linux
unit:nolibtool:sid:amd64

00:00:54

 
  System
passed #1256490
amd64 linux
system:clang:asan

00:12:30

passed #1256494
amd64 linux
system:clang:buster:amd64

00:11:05

passed #1256497
amd64 libvirt
system:clang:freebsd11:amd64

00:10:35

passed #1256498
amd64 libvirt
system:clang:freebsd12:amd64

00:10:12

failed #1256492
amd64 linux allowed to fail
system:clang:tsan

00:14:25

passed #1256478
amd64 linux
system:gcc:alpine3.12:amd64

00:11:48

passed #1256489
amd64 linux
system:gcc:asan

00:12:42

passed #1256483
amd64 linux
system:gcc:buster:amd64

00:12:06

passed #1256479
amd64 linux
system:gcc:centos6:amd64

00:11:32

passed #1256480
amd64 linux
system:gcc:centos7:amd64

00:11:20

passed #1256481
amd64 linux
system:gcc:centos8:amd64

00:11:40

failed #1256488
amd64 linux
system:gcc:focal:amd64

00:11:31

passed #1256493
amd64 linux
system:gcc:mutexatomics

00:12:01

passed #1256484
amd64 linux
system:gcc:sid:amd64

00:10:51

passed #1256485
i386 linux
system:gcc:sid:i386

00:10:27

passed #1256495
amd64 linux
system:gcc:softhsm2.4

00:11:03

failed #1256496
amd64 linux
system:gcc:softhsm2.6

00:11:30

passed #1256482
amd64 linux
system:gcc:stretch:amd64

00:11:34

passed #1256491
amd64 linux
system:gcc:tsan

00:14:48

passed #1256486
amd64 linux
system:gcc:tumbleweed:amd64

00:10:57

passed #1256487
amd64 linux
system:gcc:xenial:amd64

00:11:32

failed #1256499
amd64 linux
system:nolibtool:sid:amd64

00:12:11

 
  Docs
passed #1256500
amd64 linux
docs

00:02:13

 
  Postcheck
passed #1256504
amd64 linux
cppcheck

00:00:20

passed #1256501
amd64 linux
flake8

00:00:19

passed #1256505
amd64 linux
gcov

00:00:32

76.0%
passed #1256502
amd64 linux
pylint

00:00:21

passed #1256503
amd64 linux
scan-build

00:09:42

 
Name Stage Failure
failed
system:clang:tsan System
Running after_script
Running after script...
$ find bin -name 'tsan.*' -exec python3 util/parse_tsan.py {} \;
Uploading artifacts for failed job
Uploading artifacts...
untracked: found 1461 files

Uploading artifacts as "archive" to coordinator... ok
id=1256492 responseStatus=201 Created token=HEA9fFj6
Cleaning up file based variables
ERROR: Job failed: exit code 1
failed
system:nolibtool:sid:amd64 System
I:The following system tests failed:
I: inline
make: *** [Makefile:491: test] Error 1
Uploading artifacts for failed job
Uploading artifacts...
untracked: found 1369 files

Uploading artifacts as "archive" to coordinator... ok
id=1256499 responseStatus=201 Created token=oGig6GBi
Cleaning up file based variables
ERROR: Job failed: exit code 1
failed
system:gcc:softhsm2.6 System
I:The following system tests failed:
I: kasp
make: *** [Makefile:491: test] Error 1
Uploading artifacts for failed job
Uploading artifacts...
untracked: found 4503 files

Uploading artifacts as "archive" to coordinator... ok
id=1256496 responseStatus=201 Created token=ACmB8xK_
Cleaning up file based variables
ERROR: Job failed: exit code 1
failed
system:gcc:focal:amd64 System
I:The following system tests failed:
I: kasp
make: *** [Makefile:491: test] Error 1
Uploading artifacts for failed job
Uploading artifacts...
untracked: found 4425 files

Uploading artifacts as "archive" to coordinator... ok
id=1256488 responseStatus=201 Created token=66ZxYMBe
Cleaning up file based variables
ERROR: Job failed: exit code 1