speling is difikult

76 jobs for !4571 with 2392-xot-xfrin in 4 minutes and 27 seconds (queued for 7 seconds)
detached
Status Job ID Name Coverage
  Autoconf
passed #1408590
amd64 linux
autoreconf

00:00:17

 
  Precheck
failed #1408592
amd64 linux
clang-format

00:00:17

passed #1408593
amd64 linux
coccinelle

00:03:15

failed #1408594
amd64 linux
danger

00:00:14

failed #1408591
amd64 linux
misc

00:00:12

failed #1408595
amd64 linux
tarball-create

00:01:15

 
  Build
failed #1408608
amd64 linux
clang:asan

00:01:39

failed #1408612
amd64 linux
clang:buster:amd64

00:00:58

failed #1408615
amd64 libvirt
clang:freebsd11:amd64

00:01:05

failed #1408616
amd64 libvirt
clang:freebsd12:amd64

00:01:04

failed #1408617
amd64 libvirt
clang:openbsd:amd64

00:02:20

failed #1408610
amd64 linux
clang:tsan

00:01:05

failed #1408596
amd64 linux
gcc:alpine3.12:amd64

00:00:53

failed #1408607
amd64 linux
gcc:asan

00:01:33

failed #1408600
amd64 linux
gcc:buster:amd64

00:00:41

failed #1408597
amd64 linux
gcc:centos7:amd64

00:00:45

failed #1408598
amd64 linux
gcc:centos8:amd64

00:00:45

failed #1408606
amd64 linux
gcc:focal:amd64

00:00:50

failed #1408611
amd64 linux
gcc:mutexatomics

00:00:58

failed #1408602
amd64 linux
gcc:out-of-tree

00:00:46

failed #1408601
amd64 linux
gcc:sid:amd64

00:00:52

failed #1408603
i386 linux
gcc:sid:i386

00:00:52

failed #1408613
amd64 linux
gcc:softhsm2.4

00:00:50

failed #1408614
amd64 linux
gcc:softhsm2.6

00:00:52

failed #1408599
amd64 linux
gcc:stretch:amd64

00:00:58

failed #1408609
amd64 linux
gcc:tsan

00:00:56

failed #1408604
amd64 linux
gcc:tumbleweed:amd64

00:01:02

failed #1408605
amd64 linux
gcc:xenial:amd64

00:01:04

failed #1408618
amd64 windows
msvc:windows:amd64

00:00:39

 
  Unit
skipped #1408630
amd64 linux
unit:clang:asan
skipped #1408634
amd64 linux
unit:clang:buster:amd64
skipped #1408637
amd64 libvirt
unit:clang:freebsd11:amd64
skipped #1408638
amd64 libvirt
unit:clang:freebsd12:amd64
skipped #1408639
amd64 libvirt
unit:clang:openbsd:amd64
skipped #1408632
amd64 linux
unit:clang:tsan
skipped #1408619
amd64 linux
unit:gcc:alpine3.12:amd64
skipped #1408629
amd64 linux
unit:gcc:asan
skipped #1408623
amd64 linux
unit:gcc:buster:amd64
skipped #1408620
amd64 linux
unit:gcc:centos7:amd64
skipped #1408621
amd64 linux
unit:gcc:centos8:amd64
skipped #1408628
amd64 linux
unit:gcc:focal:amd64
skipped #1408633
amd64 linux
unit:gcc:mutexatomics
skipped #1408624
amd64 linux
unit:gcc:sid:amd64
skipped #1408625
i386 linux
unit:gcc:sid:i386
skipped #1408635
amd64 linux
unit:gcc:softhsm2.4
skipped #1408636
amd64 linux
unit:gcc:softhsm2.6
skipped #1408622
amd64 linux
unit:gcc:stretch:amd64
skipped #1408631
amd64 linux
unit:gcc:tsan
skipped #1408626
amd64 linux
unit:gcc:tumbleweed:amd64
skipped #1408627
amd64 linux
unit:gcc:xenial:amd64
 
  System
skipped #1408651
amd64 linux
system:clang:asan
skipped #1408655
amd64 linux
system:clang:buster:amd64
skipped #1408658
amd64 libvirt
system:clang:freebsd11:amd64
skipped #1408659
amd64 libvirt
system:clang:freebsd12:amd64
skipped #1408653
amd64 linux allowed to fail
system:clang:tsan
skipped #1408640
amd64 linux
system:gcc:alpine3.12:amd64
skipped #1408650
amd64 linux
system:gcc:asan
skipped #1408644
amd64 linux
system:gcc:buster:amd64
skipped #1408641
amd64 linux
system:gcc:centos7:amd64
skipped #1408642
amd64 linux
system:gcc:centos8:amd64
skipped #1408649
amd64 linux
system:gcc:focal:amd64
skipped #1408654
amd64 linux
system:gcc:mutexatomics
skipped #1408645
amd64 linux
system:gcc:sid:amd64
skipped #1408646
i386 linux
system:gcc:sid:i386
skipped #1408656
amd64 linux
system:gcc:softhsm2.4
skipped #1408657
amd64 linux
system:gcc:softhsm2.6
skipped #1408643
amd64 linux
system:gcc:stretch:amd64
skipped #1408652
amd64 linux allowed to fail
system:gcc:tsan
skipped #1408647
amd64 linux
system:gcc:tumbleweed:amd64
skipped #1408648
amd64 linux
system:gcc:xenial:amd64
 
  Docs
passed #1408660
amd64 linux
docs

00:00:49

 
  Postcheck
passed #1408664
amd64 linux
cppcheck

00:00:49

passed #1408661
amd64 linux
flake8

00:00:23

skipped #1408665
amd64 linux
gcov
passed #1408662
amd64 linux
pylint

00:00:21

passed #1408663
amd64 linux
scan-build

00:03:58

 
Name Stage Failure
failed
clang:openbsd:amd64 Build
Error target(s) unaccounted for: all-recursive 
Errors while building
*** Error 2 in target 'all', line 531 of Makefile (continuing)
Error target(s) unaccounted for: all
Running after_script
Running after script...
$ test -n "${OUT_OF_TREE_WORKSPACE}" && mv "${OUT_OF_TREE_WORKSPACE}" "${CI_PROJECT_DIR}"
Cleaning up file based variables
ERROR: Job failed: exit status 1
failed
clang:asan Build
make[2]: Leaving directory '/builds/isc-projects/bind9/fuzz'
make[1]: *** [Makefile:627: all-recursive] Error 1
make[1]: Leaving directory '/builds/isc-projects/bind9'
make: *** [Makefile:531: all] Error 2
Running after_script
Running after script...
$ test -n "${OUT_OF_TREE_WORKSPACE}" && mv "${OUT_OF_TREE_WORKSPACE}" "${CI_PROJECT_DIR}"
Cleaning up file based variables
ERROR: Job failed: exit code 1
failed
gcc:asan Build
make[2]: Leaving directory '/builds/isc-projects/bind9/fuzz'
make[1]: *** [Makefile:627: all-recursive] Error 1
make[1]: Leaving directory '/builds/isc-projects/bind9'
make: *** [Makefile:531: all] Error 2
Running after_script
Running after script...
$ test -n "${OUT_OF_TREE_WORKSPACE}" && mv "${OUT_OF_TREE_WORKSPACE}" "${CI_PROJECT_DIR}"
Cleaning up file based variables
ERROR: Job failed: exit code 1
failed
tarball-create Precheck
Making all in fuzz
make[2]: Entering directory '/builds/isc-projects/bind9/fuzz'
make[2]: Nothing to be done for 'all'.
make[2]: Leaving directory '/builds/isc-projects/bind9/fuzz'
make[1]: Leaving directory '/builds/isc-projects/bind9'
$ if test "$(git status --porcelain | grep -Ev '\?\?' | wc -l)" -gt "0"; then git status --short; exit 1; fi
M doc/man/named.conf.5in
Cleaning up file based variables
ERROR: Job failed: exit code 1
failed
clang:freebsd12:amd64 Build
/bin/sh ../../libtool  --tag=CC    --mode=link cc  -Wall -Wextra -Wwrite-strings -Wcast-qual -Wpointer-arith -Wno-missing-field-initializers -Wformat -Wshadow -Werror=implicit-function-declaration -Werror=missing-prototypes -Werror=format-security -Werror=parentheses -Werror=implicit -Werror=strict-prototypes -fno-strict-aliasing -fno-delete-null-pointer-checks -fdiagnostics-show-option -Werror -fno-omit-frame-pointer -fno-optimize-sibling-calls -O1 -g -Wall -Wextra -pthread -avoid-version -module -shared -export-dynamic  -o  filter-aaaa.la -rpath /builds/isc-projects/bind9/.local/lib/bind filter-aaaa.lo  -lexecinfo
libtool: link: cc -shared -fPIC -DPIC .libs/filter-aaaa.o -lexecinfo -O1 -g -pthread -pthread -Wl,-soname -Wl,filter-aaaa.so -o .libs/filter-aaaa.so
libtool: link: ( cd ".libs" && rm -f "filter-aaaa.la" && ln -s "../filter-aaaa.la" "filter-aaaa.la" )
Making all in fuzz
Running after_script
Running after script...
$ test -n "${OUT_OF_TREE_WORKSPACE}" && mv "${OUT_OF_TREE_WORKSPACE}" "${CI_PROJECT_DIR}"
Cleaning up file based variables
ERROR: Job failed: exit status 1
failed
gcc:xenial:amd64 Build
Makefile:627: recipe for target 'all-recursive' failed
make[1]: Leaving directory '/builds/isc-projects/bind9'
make: *** [all] Error 2
Makefile:531: recipe for target 'all' failed
Running after_script
Running after script...
$ test -n "${OUT_OF_TREE_WORKSPACE}" && mv "${OUT_OF_TREE_WORKSPACE}" "${CI_PROJECT_DIR}"
Cleaning up file based variables
ERROR: Job failed: exit code 1
failed
clang:freebsd11:amd64 Build
make[1]: stopped in /builds/isc-projects/bind9
*** [all] Error code 1

make: stopped in /builds/isc-projects/bind9
Running after_script
Running after script...
$ test -n "${OUT_OF_TREE_WORKSPACE}" && mv "${OUT_OF_TREE_WORKSPACE}" "${CI_PROJECT_DIR}"
Cleaning up file based variables
ERROR: Job failed: exit status 1
failed
clang:tsan Build
make[2]: Leaving directory '/builds/isc-projects/bind9/fuzz'
make[1]: Leaving directory '/builds/isc-projects/bind9'
make[1]: *** [Makefile:627: all-recursive] Error 1
make: *** [Makefile:531: all] Error 2
Running after_script
Running after script...
$ test -n "${OUT_OF_TREE_WORKSPACE}" && mv "${OUT_OF_TREE_WORKSPACE}" "${CI_PROJECT_DIR}"
Cleaning up file based variables
ERROR: Job failed: exit code 1
failed
gcc:tumbleweed:amd64 Build
make[2]: Leaving directory '/builds/isc-projects/bind9/fuzz'
make[1]: *** [Makefile:627: all-recursive] Error 1
make[1]: Leaving directory '/builds/isc-projects/bind9'
make: *** [Makefile:531: all] Error 2
Running after_script
Running after script...
$ test -n "${OUT_OF_TREE_WORKSPACE}" && mv "${OUT_OF_TREE_WORKSPACE}" "${CI_PROJECT_DIR}"
Cleaning up file based variables
ERROR: Job failed: exit code 1
failed
clang:buster:amd64 Build
make[2]: Leaving directory '/builds/isc-projects/bind9/fuzz'
make[1]: *** [Makefile:627: all-recursive] Error 1
make[1]: Leaving directory '/builds/isc-projects/bind9'
make: *** [Makefile:531: all] Error 2
Running after_script
Running after script...
$ test -n "${OUT_OF_TREE_WORKSPACE}" && mv "${OUT_OF_TREE_WORKSPACE}" "${CI_PROJECT_DIR}"
Cleaning up file based variables
ERROR: Job failed: exit code 1
failed
gcc:tsan Build
make[2]: Leaving directory '/builds/isc-projects/bind9/fuzz'
make[1]: *** [Makefile:627: all-recursive] Error 1
make[1]: Leaving directory '/builds/isc-projects/bind9'
make: *** [Makefile:531: all] Error 2
Running after_script
Running after script...
$ test -n "${OUT_OF_TREE_WORKSPACE}" && mv "${OUT_OF_TREE_WORKSPACE}" "${CI_PROJECT_DIR}"
Cleaning up file based variables
ERROR: Job failed: exit code 1
failed
gcc:mutexatomics Build
make[2]: Leaving directory '/builds/isc-projects/bind9/fuzz'
make[1]: *** [Makefile:627: all-recursive] Error 1
make[1]: Leaving directory '/builds/isc-projects/bind9'
make: *** [Makefile:531: all] Error 2
Running after_script
Running after script...
$ test -n "${OUT_OF_TREE_WORKSPACE}" && mv "${OUT_OF_TREE_WORKSPACE}" "${CI_PROJECT_DIR}"
Cleaning up file based variables
ERROR: Job failed: exit code 1
failed
gcc:stretch:amd64 Build
make[1]: Leaving directory '/builds/isc-projects/bind9'
make[1]: *** [all-recursive] Error 1
make: *** [all] Error 2
Makefile:531: recipe for target 'all' failed
Running after_script
Running after script...
$ test -n "${OUT_OF_TREE_WORKSPACE}" && mv "${OUT_OF_TREE_WORKSPACE}" "${CI_PROJECT_DIR}"
Cleaning up file based variables
ERROR: Job failed: exit code 1
failed
gcc:softhsm2.4 Build
make[2]: Leaving directory '/builds/isc-projects/bind9/fuzz'
make[1]: *** [Makefile:627: all-recursive] Error 1
make[1]: Leaving directory '/builds/isc-projects/bind9'
make: *** [Makefile:531: all] Error 2
Running after_script
Running after script...
$ test -n "${OUT_OF_TREE_WORKSPACE}" && mv "${OUT_OF_TREE_WORKSPACE}" "${CI_PROJECT_DIR}"
Cleaning up file based variables
ERROR: Job failed: exit code 1
failed
gcc:sid:i386 Build
make[2]: Leaving directory '/builds/isc-projects/bind9/fuzz'
make[1]: *** [Makefile:627: all-recursive] Error 1
make[1]: Leaving directory '/builds/isc-projects/bind9'
make: *** [Makefile:531: all] Error 2
Running after_script
Running after script...
$ test -n "${OUT_OF_TREE_WORKSPACE}" && mv "${OUT_OF_TREE_WORKSPACE}" "${CI_PROJECT_DIR}"
Cleaning up file based variables
ERROR: Job failed: exit code 1
failed
gcc:softhsm2.6 Build
make[2]: Leaving directory '/builds/isc-projects/bind9/fuzz'
make[1]: *** [Makefile:627: all-recursive] Error 1
make[1]: Leaving directory '/builds/isc-projects/bind9'
make: *** [Makefile:531: all] Error 2
Running after_script
Running after script...
$ test -n "${OUT_OF_TREE_WORKSPACE}" && mv "${OUT_OF_TREE_WORKSPACE}" "${CI_PROJECT_DIR}"
Cleaning up file based variables
ERROR: Job failed: exit code 1
failed
gcc:focal:amd64 Build
make[2]: Leaving directory '/builds/isc-projects/bind9/fuzz'
make[1]: *** [Makefile:627: all-recursive] Error 1
make[1]: Leaving directory '/builds/isc-projects/bind9'
make: *** [Makefile:531: all] Error 2
Running after_script
Running after script...
$ test -n "${OUT_OF_TREE_WORKSPACE}" && mv "${OUT_OF_TREE_WORKSPACE}" "${CI_PROJECT_DIR}"
Cleaning up file based variables
ERROR: Job failed: exit code 1
failed
gcc:sid:amd64 Build
make[2]: Leaving directory '/builds/isc-projects/bind9/fuzz'
make[1]: Leaving directory '/builds/isc-projects/bind9'
make[1]: *** [Makefile:627: all-recursive] Error 1
make: *** [Makefile:531: all] Error 2
Running after_script
Running after script...
$ test -n "${OUT_OF_TREE_WORKSPACE}" && mv "${OUT_OF_TREE_WORKSPACE}" "${CI_PROJECT_DIR}"
Cleaning up file based variables
ERROR: Job failed: exit code 1
failed
gcc:alpine3.12:amd64 Build
make[2]: Leaving directory '/builds/isc-projects/bind9/fuzz'
make[1]: *** [Makefile:627: all-recursive] Error 1
make[1]: Leaving directory '/builds/isc-projects/bind9'
make: *** [Makefile:531: all] Error 2
Running after_script
Running after script...
$ test -n "${OUT_OF_TREE_WORKSPACE}" && mv "${OUT_OF_TREE_WORKSPACE}" "${CI_PROJECT_DIR}"
Cleaning up file based variables
ERROR: Job failed: exit code 1
failed
gcc:out-of-tree Build
make[2]: Leaving directory '/tmp/out_of_tree_workspace/fuzz'
make[1]: *** [Makefile:627: all-recursive] Error 1
make[1]: Leaving directory '/tmp/out_of_tree_workspace'
make: *** [Makefile:531: all] Error 2
Running after_script
Running after script...
$ test -n "${OUT_OF_TREE_WORKSPACE}" && mv "${OUT_OF_TREE_WORKSPACE}" "${CI_PROJECT_DIR}"
Cleaning up file based variables
ERROR: Job failed: exit code 1
failed
gcc:centos8:amd64 Build
make[2]: Leaving directory '/builds/isc-projects/bind9/fuzz'
make[1]: Leaving directory '/builds/isc-projects/bind9'
make[1]: *** [Makefile:627: all-recursive] Error 1
make: *** [Makefile:531: all] Error 2
Running after_script
Running after script...
$ test -n "${OUT_OF_TREE_WORKSPACE}" && mv "${OUT_OF_TREE_WORKSPACE}" "${CI_PROJECT_DIR}"
Cleaning up file based variables
ERROR: Job failed: exit code 1
failed
gcc:centos7:amd64 Build
make[2]: Leaving directory `/builds/isc-projects/bind9/fuzz'
make[1]: *** [all-recursive] Error 1
make[1]: Leaving directory `/builds/isc-projects/bind9'
make: *** [all] Error 2
Running after_script
Running after script...
$ test -n "${OUT_OF_TREE_WORKSPACE}" && mv "${OUT_OF_TREE_WORKSPACE}" "${CI_PROJECT_DIR}"
Cleaning up file based variables
ERROR: Job failed: exit code 1
failed
gcc:buster:amd64 Build
make[2]: Leaving directory '/builds/isc-projects/bind9/fuzz'
make[1]: Leaving directory '/builds/isc-projects/bind9'
make[1]: *** [Makefile:627: all-recursive] Error 1
make: *** [Makefile:531: all] Error 2
Running after_script
Running after script...
$ test -n "${OUT_OF_TREE_WORKSPACE}" && mv "${OUT_OF_TREE_WORKSPACE}" "${CI_PROJECT_DIR}"
Cleaning up file based variables
ERROR: Job failed: exit code 1
failed
msvc:windows:amd64 Build
OS/Arch:      windows/amd64
Uploading artifacts...
Runtime platform
arch=amd64 os=windows pid=19008 revision=ece86343 version=13.5.0
untracked: found 444 files

WARNING: Failed to load system CertPool: crypto/x509: system root pool is not available on Windows
Uploading artifacts as "archive" to coordinator... ok
id=1408618 responseStatus=201 Created token=cEKapUU7
Cleaning up file based variables
Unsupported run stage "cleanup_file_variables"
ERROR: Job failed: exit status 1
failed
clang-format Precheck
 M lib/dns/include/dns/xfrin.h
M lib/dns/include/dns/zone.h
M lib/dns/ipkeylist.c
M lib/dns/transport.c
M lib/dns/view.c
M lib/dns/xfrin.c
M lib/dns/zone.c
Cleaning up file based variables
ERROR: Job failed: exit code 1
failed
danger Precheck
 * branch            main       -> FETCH_HEAD



Failing the build, there are 2 fails.
Feedback: https://gitlab.isc.org/isc-projects/bind9/merge_requests/4571#note_187120

Cleaning up file based variables
ERROR: Job failed: exit code 1
failed
misc Precheck
Executing "step_script" stage of the job script
$ sh util/checklibs.sh > checklibs.out
Uploading artifacts for failed job
Uploading artifacts...
WARNING: util/newcopyrights: no matching files
checklibs.out: found 1 matching files and directories

Uploading artifacts as "archive" to coordinator... ok
id=1408591 responseStatus=201 Created token=SwC6-jPY
Cleaning up file based variables
ERROR: Job failed: exit code 1