Add kasp test todo for [#2375]

This bugfix has been manually verified but is missing a unit test.
Created GL #2471 to track this.

(cherry picked from commit 38600806)
77 jobs for !4647 with 2375-dnssec-policy-three-is-a-crowd-rollover-bug-v9_16 in 42 minutes and 10 seconds (queued for 14 seconds)
detached
Status Job ID Name Coverage
  Precheck
passed #1460884
amd64 linux
autoreconf

00:00:17

passed #1460886
amd64 linux
clang-format

00:00:17

passed #1460887
amd64 linux
coccinelle

00:03:35

passed #1460888
amd64 linux
danger

00:00:15

passed #1460885
amd64 linux
misc

00:00:13

 
  Build
passed #1460901
amd64 linux
clang:asan

00:03:58

passed #1460905
amd64 linux
clang:buster:amd64

00:02:06

passed #1460908
amd64 libvirt
clang:freebsd11:amd64

00:01:53

passed #1460909
amd64 libvirt
clang:freebsd12:amd64

00:01:36

passed #1460910
amd64 libvirt
clang:openbsd:amd64

00:03:54

passed #1460903
amd64 linux
clang:tsan

00:02:23

passed #1460889
amd64 linux
gcc:alpine3.12:amd64

00:01:31

passed #1460900
amd64 linux
gcc:asan

00:03:37

passed #1460893
amd64 linux
gcc:buster:amd64

00:01:24

passed #1460890
amd64 linux
gcc:centos7:amd64

00:01:25

passed #1460891
amd64 linux
gcc:centos8:amd64

00:01:52

passed #1460899
amd64 linux
gcc:focal:amd64

00:01:43

passed #1460904
amd64 linux
gcc:mutexatomics

00:01:27

passed #1460895
amd64 linux
gcc:out-of-tree

00:01:27

passed #1460894
amd64 linux
gcc:sid:amd64

00:02:13

passed #1460896
i386 linux
gcc:sid:i386

00:01:35

passed #1460906
amd64 linux
gcc:softhsm2.4

00:01:29

passed #1460907
amd64 linux
gcc:softhsm2.6

00:01:38

passed #1460892
amd64 linux
gcc:stretch:amd64

00:02:00

passed #1460902
amd64 linux
gcc:tsan

00:01:52

passed #1460897
amd64 linux
gcc:tumbleweed:amd64

00:01:26

passed #1460898
amd64 linux
gcc:xenial:amd64

00:01:35

passed #1460912
amd64 windows
msvc:windows:amd64

00:01:01

passed #1460911
amd64 linux
nolibtool:sid:amd64

00:02:00

 
  Unit
passed #1460924
amd64 linux
unit:clang:asan

00:00:53

passed #1460928
amd64 linux
unit:clang:buster:amd64

00:00:35

passed #1460931
amd64 libvirt
unit:clang:freebsd11:amd64

00:01:01

passed #1460932
amd64 libvirt
unit:clang:freebsd12:amd64

00:01:00

passed #1460926
amd64 linux
unit:clang:tsan

00:01:31

passed #1460913
amd64 linux
unit:gcc:alpine3.12:amd64

00:00:38

passed #1460923
amd64 linux
unit:gcc:asan

00:00:56

passed #1460917
amd64 linux
unit:gcc:buster:amd64

00:00:55

passed #1460914
amd64 linux
unit:gcc:centos7:amd64

00:00:45

passed #1460915
amd64 linux
unit:gcc:centos8:amd64

00:00:37

passed #1460922
amd64 linux
unit:gcc:focal:amd64

00:00:38

passed #1460927
amd64 linux
unit:gcc:mutexatomics

00:00:37

passed #1460918
amd64 linux
unit:gcc:sid:amd64

00:00:39

passed #1460919
i386 linux
unit:gcc:sid:i386

00:00:47

passed #1460929
amd64 linux
unit:gcc:softhsm2.4

00:00:36

passed #1460930
amd64 linux
unit:gcc:softhsm2.6

00:00:38

passed #1460916
amd64 linux
unit:gcc:stretch:amd64

00:00:38

passed #1460925
amd64 linux
unit:gcc:tsan

00:01:50

passed #1460920
amd64 linux
unit:gcc:tumbleweed:amd64

00:00:33

passed #1460921
amd64 linux
unit:gcc:xenial:amd64

00:00:39

passed #1460933
amd64 linux
unit:nolibtool:sid:amd64

00:01:01

 
  System
failed #1460945
amd64 linux
system:clang:asan

00:13:31

failed #1460949
amd64 linux
system:clang:buster:amd64

00:11:45

failed #1460952
amd64 libvirt
system:clang:freebsd11:amd64

00:38:25

failed #1460953
amd64 libvirt
system:clang:freebsd12:amd64

00:36:59

failed #1460947
amd64 linux allowed to fail
system:clang:tsan

00:14:42

failed #1460934
amd64 linux
system:gcc:alpine3.12:amd64

00:13:07

failed #1460944
amd64 linux
system:gcc:asan

00:13:20

failed #1460938
amd64 linux
system:gcc:buster:amd64

00:15:22

failed #1460935
amd64 linux
system:gcc:centos7:amd64

00:12:45

failed #1460936
amd64 linux
system:gcc:centos8:amd64

00:11:50

failed #1460943
amd64 linux
system:gcc:focal:amd64

00:12:00

failed #1460948
amd64 linux
system:gcc:mutexatomics

00:12:03

failed #1460939
amd64 linux
system:gcc:sid:amd64

00:12:20

passed #1460940
i386 linux
system:gcc:sid:i386

00:09:59

failed #1460950
amd64 linux
system:gcc:softhsm2.4

00:11:55

failed #1460951
amd64 linux
system:gcc:softhsm2.6

00:11:53

failed #1460937
amd64 linux
system:gcc:stretch:amd64

00:11:19

failed #1460946
amd64 linux allowed to fail
system:gcc:tsan

00:14:49

failed #1460941
amd64 linux
system:gcc:tumbleweed:amd64

00:12:00

failed #1460942
amd64 linux
system:gcc:xenial:amd64

00:11:40

failed #1460954
amd64 linux
system:nolibtool:sid:amd64

00:12:17

 
  Docs
passed #1460955
amd64 linux
docs

00:02:20

 
  Postcheck
passed #1460959
amd64 linux
cppcheck

00:00:23

passed #1460956
amd64 linux
flake8

00:00:41

skipped #1460960
amd64 linux
gcov
passed #1460957
amd64 linux
pylint

00:00:22

passed #1460958
amd64 linux
scan-build

00:10:09

 
Name Stage Failure
failed
system:clang:freebsd11:amd64 System

make: stopped in /builds/isc-projects/bind9/bin/tests/system
Uploading artifacts for failed job
Uploading artifacts...
Runtime platform
arch=amd64 os=freebsd pid=12174 revision=775dd39d version=13.8.0
untracked: found 4346 files

Uploading artifacts as "archive" to coordinator... ok
id=1460952 responseStatus=201 Created token=s_Vw_c5h
Cleaning up file based variables
ERROR: Job failed: exit status 1
failed
system:clang:freebsd12:amd64 System

make: stopped in /builds/isc-projects/bind9/bin/tests/system
Uploading artifacts for failed job
Uploading artifacts...
Runtime platform
arch=amd64 os=freebsd pid=13191 revision=775dd39d version=13.8.0
untracked: found 4391 files

Uploading artifacts as "archive" to coordinator... ok
id=1460953 responseStatus=201 Created token=mdAMyTak
Cleaning up file based variables
ERROR: Job failed: exit status 1
failed
system:gcc:buster:amd64 System
I:The following system tests failed:
I: kasp
make: *** [Makefile:491: test] Error 1
Uploading artifacts for failed job
Uploading artifacts...
untracked: found 5484 files

Uploading artifacts as "archive" to coordinator... ok
id=1460938 responseStatus=201 Created token=vA8zfjbv
Cleaning up file based variables
ERROR: Job failed: exit code 1
failed
system:clang:tsan System
Running after_script
Running after script...
$ find bin -name 'tsan.*' -exec python3 util/parse_tsan.py {} \;
Uploading artifacts for failed job
Uploading artifacts...
untracked: found 2525 files

Uploading artifacts as "archive" to coordinator... ok
id=1460947 responseStatus=201 Created token=sRRD7Y9d
Cleaning up file based variables
ERROR: Job failed: exit code 1
failed
system:gcc:tsan System
Running after_script
Running after script...
$ find bin -name 'tsan.*' -exec python3 util/parse_tsan.py {} \;
Uploading artifacts for failed job
Uploading artifacts...
untracked: found 2476 files

Uploading artifacts as "archive" to coordinator... ok
id=1460946 responseStatus=201 Created token=3uziwqsv
Cleaning up file based variables
ERROR: Job failed: exit code 1
failed
system:clang:asan System
I:      kasp
I: statschannel
make: *** [Makefile:491: test] Error 1
Uploading artifacts for failed job
Uploading artifacts...
untracked: found 2451 files

Uploading artifacts as "archive" to coordinator... ok
id=1460945 responseStatus=201 Created token=ExezHzw1
Cleaning up file based variables
ERROR: Job failed: exit code 1
failed
system:nolibtool:sid:amd64 System
I:      kasp
I: statschannel
make: *** [Makefile:491: test] Error 1
Uploading artifacts for failed job
Uploading artifacts...
untracked: found 2147 files

Uploading artifacts as "archive" to coordinator... ok
id=1460954 responseStatus=201 Created token=2xFw2Yx6
Cleaning up file based variables
ERROR: Job failed: exit code 1
failed
system:gcc:asan System
I:      kasp
I: statschannel
make: *** [Makefile:491: test] Error 1
Uploading artifacts for failed job
Uploading artifacts...
untracked: found 2470 files

Uploading artifacts as "archive" to coordinator... ok
id=1460944 responseStatus=201 Created token=AbNAPuE8
Cleaning up file based variables
ERROR: Job failed: exit code 1
failed
system:gcc:softhsm2.6 System
I:      kasp
I: statschannel
make: *** [Makefile:491: test] Error 1
Uploading artifacts for failed job
Uploading artifacts...
untracked: found 2547 files

Uploading artifacts as "archive" to coordinator... ok
id=1460951 responseStatus=201 Created token=WTWZpP_Y
Cleaning up file based variables
ERROR: Job failed: exit code 1
failed
system:gcc:softhsm2.4 System
I:      kasp
I: statschannel
make: *** [Makefile:491: test] Error 1
Uploading artifacts for failed job
Uploading artifacts...
untracked: found 2998 files

Uploading artifacts as "archive" to coordinator... ok
id=1460950 responseStatus=201 Created token=sLrVDwVK
Cleaning up file based variables
ERROR: Job failed: exit code 1
failed
system:clang:buster:amd64 System
I:      kasp
I: statschannel
make: *** [Makefile:491: test] Error 1
Uploading artifacts for failed job
Uploading artifacts...
untracked: found 2484 files

Uploading artifacts as "archive" to coordinator... ok
id=1460949 responseStatus=201 Created token=o6aw2DsA
Cleaning up file based variables
ERROR: Job failed: exit code 1
failed
system:gcc:mutexatomics System
I:      kasp
I: statschannel
make: *** [Makefile:491: test] Error 1
Uploading artifacts for failed job
Uploading artifacts...
untracked: found 2647 files

Uploading artifacts as "archive" to coordinator... ok
id=1460948 responseStatus=201 Created token=2x9uDZn9
Cleaning up file based variables
ERROR: Job failed: exit code 1
failed
system:gcc:alpine3.12:amd64 System
I:      kasp
I: statschannel
make: *** [Makefile:491: test] Error 1
Uploading artifacts for failed job
Uploading artifacts...
untracked: found 4490 files

Uploading artifacts as "archive" to coordinator... ok
id=1460934 responseStatus=201 Created token=Xbj7Z8hE
Cleaning up file based variables
ERROR: Job failed: exit code 1
failed
system:gcc:centos7:amd64 System
I:      kasp
I: statschannel
make: *** [test] Error 1
Uploading artifacts for failed job
Uploading artifacts...
untracked: found 3880 files

Uploading artifacts as "archive" to coordinator... ok
id=1460935 responseStatus=201 Created token=eMtDrBvz
Cleaning up file based variables
ERROR: Job failed: exit code 1
failed
system:gcc:sid:amd64 System
I:      kasp
I: statschannel
make: *** [Makefile:491: test] Error 1
Uploading artifacts for failed job
Uploading artifacts...
untracked: found 2721 files

Uploading artifacts as "archive" to coordinator... ok
id=1460939 responseStatus=201 Created token=hxzZSmZq
Cleaning up file based variables
ERROR: Job failed: exit code 1
failed
system:gcc:focal:amd64 System
I:      kasp
I: statschannel
make: *** [Makefile:491: test] Error 1
Uploading artifacts for failed job
Uploading artifacts...
untracked: found 2455 files

Uploading artifacts as "archive" to coordinator... ok
id=1460943 responseStatus=201 Created token=i6dLuJ-n
Cleaning up file based variables
ERROR: Job failed: exit code 1
failed
system:gcc:tumbleweed:amd64 System
I:      kasp
I: statschannel
make: *** [Makefile:491: test] Error 1
Uploading artifacts for failed job
Uploading artifacts...
untracked: found 2482 files

Uploading artifacts as "archive" to coordinator... ok
id=1460941 responseStatus=201 Created token=JRRFQe_6
Cleaning up file based variables
ERROR: Job failed: exit code 1
failed
system:gcc:xenial:amd64 System
I:      statschannel
make: *** [test] Error 1
Makefile:489: recipe for target 'test' failed
Uploading artifacts for failed job
Uploading artifacts...
untracked: found 2484 files

Uploading artifacts as "archive" to coordinator... ok
id=1460942 responseStatus=201 Created token=R99aZLQm
Cleaning up file based variables
ERROR: Job failed: exit code 1
failed
system:gcc:centos8:amd64 System
I:      kasp
I: statschannel
make: *** [Makefile:491: test] Error 1
Uploading artifacts for failed job
Uploading artifacts...
untracked: found 2485 files

Uploading artifacts as "archive" to coordinator... ok
id=1460936 responseStatus=201 Created token=gP91RccR
Cleaning up file based variables
ERROR: Job failed: exit code 1
failed
system:gcc:stretch:amd64 System
I:      statschannel
make: *** [test] Error 1
Makefile:489: recipe for target 'test' failed
Uploading artifacts for failed job
Uploading artifacts...
untracked: found 2416 files

Uploading artifacts as "archive" to coordinator... ok
id=1460937 responseStatus=201 Created token=8GsW4Pz3
Cleaning up file based variables
ERROR: Job failed: exit code 1