Gotta make you understand

73 jobs for !3858 with ondrej/provide-default-memory-context in 15 minutes and 20 seconds (queued for 8 seconds)
detached
Status Job ID Name Coverage
  Autoconf
passed #1466014
linux amd64
autoreconf

00:00:17

 
  Precheck
failed #1466016
linux amd64
clang-format

00:00:17

failed #1466017
linux amd64
coccinelle

00:03:43

failed #1466018
linux amd64
danger

00:00:16

failed #1466015
linux amd64
misc

00:00:15

failed #1466019
linux amd64
tarball-create

00:01:10

 
  Build
passed #1466031
linux amd64
clang:asan

00:02:25

passed #1466035
linux amd64
clang:buster:amd64

00:01:06

passed #1466038
amd64 libvirt
clang:freebsd11:amd64

00:01:11

passed #1466039
amd64 libvirt
clang:freebsd12:amd64

00:01:12

failed #1466040
amd64 libvirt
clang:openbsd:amd64

00:01:58

passed #1466033
linux amd64
clang:tsan

00:01:08

passed #1466020
linux amd64
gcc:alpine3.12:amd64

00:00:52

passed #1466030
linux amd64
gcc:asan

00:01:34

passed #1466024
linux amd64
gcc:buster:amd64

00:00:51

passed #1466021
linux amd64
gcc:centos7:amd64

00:00:59

passed #1466022
linux amd64
gcc:centos8:amd64

00:00:57

passed #1466029
linux amd64
gcc:focal:amd64

00:01:08

failed #1466034
linux amd64
gcc:mutexatomics

00:00:51

passed #1466026
linux amd64
gcc:out-of-tree

00:00:57

passed #1466025
linux amd64
gcc:sid:amd64

00:01:14

passed #1466036
linux amd64
gcc:softhsm2.4

00:00:51

passed #1466037
linux amd64
gcc:softhsm2.6

00:00:57

passed #1466023
linux amd64
gcc:stretch:amd64

00:01:00

passed #1466032
linux amd64
gcc:tsan

00:01:03

passed #1466027
linux amd64
gcc:tumbleweed:amd64

00:01:06

passed #1466028
linux amd64
gcc:xenial:amd64

00:00:57

failed #1466041
amd64 windows
msvc:windows:amd64

00:00:33

 
  Unit
failed #1466052
linux amd64
unit:clang:asan

00:00:59

failed #1466056
linux amd64
unit:clang:buster:amd64

00:00:42

failed #1466059
amd64 libvirt
unit:clang:freebsd11:amd64

00:01:03

failed #1466060
amd64 libvirt
unit:clang:freebsd12:amd64

00:00:59

skipped #1466061
amd64 libvirt
unit:clang:openbsd:amd64
failed #1466054
linux amd64
unit:clang:tsan

00:00:36

failed #1466042
linux amd64
unit:gcc:alpine3.12:amd64

00:01:21

failed #1466051
linux amd64
unit:gcc:asan

00:02:32

failed #1466046
linux amd64
unit:gcc:buster:amd64

00:02:11

failed #1466043
linux amd64
unit:gcc:centos7:amd64

00:01:32

failed #1466044
linux amd64
unit:gcc:centos8:amd64

00:01:41

failed #1466050
linux amd64
unit:gcc:focal:amd64

00:01:43

skipped #1466055
linux amd64
unit:gcc:mutexatomics
failed #1466047
linux amd64
unit:gcc:sid:amd64

00:01:45

failed #1466057
linux amd64
unit:gcc:softhsm2.4

00:01:36

failed #1466058
linux amd64
unit:gcc:softhsm2.6

00:01:35

failed #1466045
linux amd64
unit:gcc:stretch:amd64

00:01:49

failed #1466053
linux amd64
unit:gcc:tsan

00:02:30

failed #1466048
linux amd64
unit:gcc:tumbleweed:amd64

00:01:38

failed #1466049
linux amd64
unit:gcc:xenial:amd64

00:01:43

 
  System
failed #1466072
linux amd64
system:clang:asan

00:12:27

failed #1466076
linux amd64
system:clang:buster:amd64

00:08:42

passed #1466079
amd64 libvirt
system:clang:freebsd11:amd64

00:02:06

passed #1466080
amd64 libvirt
system:clang:freebsd12:amd64

00:01:49

failed #1466074
linux amd64 allowed to fail
system:clang:tsan

00:06:45

failed #1466062
linux amd64
system:gcc:alpine3.12:amd64

00:06:32

failed #1466071
linux amd64
system:gcc:asan

00:11:35

skipped #1466066
linux amd64
system:gcc:buster:amd64
failed #1466063
linux amd64
system:gcc:centos7:amd64

00:07:52

failed #1466064
linux amd64
system:gcc:centos8:amd64

00:09:04

failed #1466070
linux amd64
system:gcc:focal:amd64

00:08:05

skipped #1466075
linux amd64
system:gcc:mutexatomics
failed #1466067
linux amd64
system:gcc:sid:amd64

00:08:09

failed #1466077
linux amd64
system:gcc:softhsm2.4

00:09:10

failed #1466078
linux amd64
system:gcc:softhsm2.6

00:08:15

failed #1466065
linux amd64
system:gcc:stretch:amd64

00:08:42

failed #1466073
linux amd64 allowed to fail
system:gcc:tsan

00:05:52

failed #1466068
linux amd64
system:gcc:tumbleweed:amd64

00:07:37

failed #1466069
linux amd64
system:gcc:xenial:amd64

00:08:16

 
  Docs
passed #1466081
linux amd64
docs

00:00:53

 
  Postcheck
passed #1466085
linux amd64
cppcheck

00:00:50

passed #1466082
linux amd64
flake8

00:00:23

skipped #1466086
linux amd64
gcov
passed #1466083
linux amd64
pylint

00:00:31

failed #1466084
linux amd64
scan-build

00:04:40

 
Name Stage Failure
failed
system:clang:asan System
add 0x7fc971bafd80 size 125 file rbt.c line 2244 mctx 0x6120000007c0
add 0x7fc971bafd80 size 125 file rbt.c line 2244 mctx 0x6120000007c0
add 0x7fc971bb6800 size 48 file rdataslab.c line 165 mctx 0x6120000007c0
add 0x7fc971bb6800 size 48 file rdataslab.c line 165 mctx 0x6120000007c0
add 0x7fc971bbaf90 size 174 file rdataslab.c line 270 mctx 0x6120000007c0
add 0x7fc971bbaf90 size 174 file rdataslab.c line 270 mctx 0x6120000007c0
add 0x7fc971bae7f8 size 4 file rdataslab.c line 274 mctx 0x6120000007c0
add 0x7fc971bae7f8 size 4 file rdataslab.c line 274 mctx 0x6120000007c0
d
Job's log exceeded limit of 4194304 bytes.
failed
system:gcc:asan System
add 0x7f672a562900 size 128 file rbt.c line 2330 mctx 0x6120000007c0
add 0x7f672a562900 size 128 file rbt.c line 2330 mctx 0x6120000007c0
add 0x7f672a563800 size 107 file rbt.c line 2244 mctx 0x6120000007c0
add 0x7f672a563800 size 107 file rbt.c line 2244 mctx 0x6120000007c0
add 0x7f672a563870 size 107 file rbt.c line 2244 mctx 0x6120000007c0
add 0x7f672a563870 size 107 file rbt.c line 2244 mctx 0x6120000007c0
add 0x7f672a564800 size 792 file rbtdb.c line 1325 mctx 0x6120000007c0
add 0x7f672a564800 size 792 file rbtdb.c line 1325 mctx 0x6120000007c0
add 0x7f672a559820 size 32 file rbtdb.c line 1336 mctx 0x61200000
Job's log exceeded limit of 4194304 bytes.
failed
system:gcc:centos8:amd64 System
add 0x7f998b12f010 size 48 file rdataslab.c line 165 mctx 0x2581ca0
add 0x7f998b132010 size 158 file rdataslab.c line 270 mctx 0x2581ca0
add 0x7f998b132010 size 158 file rdataslab.c line 270 mctx 0x2581ca0
add 0x7f998b129008 size 4 file rdataslab.c line 274 mctx 0x2581ca0
add 0x7f998b129008 size 4 file rdataslab.c line 274 mctx 0x2581ca0
del 0x7f998b129008 size 4 file rdataslab.c line 327 mctx 0x2581ca0
del 0x7f998b12f010 size 48 file rdataslab.c line 333 mctx 0x2581ca0
add 0x7f998b131080 size 112 file rbt.c line 2244 mctx 0x2581ca0
add 0x7f998b131080 size 112 fi
Job's log exceeded limit of 4194304 bytes.
failed
system:gcc:softhsm2.4 System
add 0x7ff77ef0d010 size 1 file name.c line 2207 mctx 0x55cd3c1d07d0
add 0x7ff77ef0d010 size 1 file name.c line 2207 mctx 0x55cd3c1d07d0
add 0x7ff77ef0a2d0 size 32 file pkcs11rsa_link.c line 1145 mctx 0x55cd3c1d07d0
add 0x7ff77ef0a2d0 size 32 file pkcs11rsa_link.c line 1145 mctx 0x55cd3c1d07d0
add 0x7ff77ef0e010 size 40 file pk11.c line 152 mctx 0x55cd3c1d07d0
add 0x7ff77ef0e010 size 40 file pk11.c line 152 mctx 0x55cd3c1d07d0
add 0x7ff77ef0a2f0 size 32 file pkcs11rsa_link.c line 1174 mctx 0x55cd3c1d07d0
add 0x7ff77ef0a2f0 size 32 file pkcs11rsa_link.c line 1174 mctx 0x55cd3c1d07d0
add 0x7ff77ef0f010 size 192 file pkcs11rsa_link.
Job's log exceeded limit of 4194304 bytes.
failed
system:clang:buster:amd64 System
D:verify:del 0x7f1f6f1a8030 size 32 file log.c line 481 mctx 0x16397d0
D:verify:del 0x7f1f6f1a8050 size 32 file log.c line 481 mctx 0x16397d0
D:verify:del 0x7f1f6f1a8070 size 32 file log.c line 481 mctx 0x16397d0
D:verify:del 0x7f1f6f1a8090 size 32 file log.c line 481 mctx 0x16397d0
D:verify:del 0x7f1f6f1a80b0 size 32 file log.c line 481 mctx 0x16397d0
D:verify:del 0x7f1f6f1a80d0 size 32 file log.c line 481 mctx 0x16397d0
D:verify:del 0x7f1f6f1a80f0 size 32 file log.c line 481 mctx 0x16397d0
D:verify:del 0x7f1f6f1a8110 size 32 file log.c line 481 mctx 0x16397d0
D:verify:del 0x7f1f6f1a8130 size 32 file log.c lin
Job's log exceeded limit of 4194304 bytes.
failed
system:gcc:stretch:amd64 System
add 0x7fefe4d5d1d0 size 32 file log.c line 955 mctx 0x563a7308e610
add 0x7fefe4d5d1d0 size 32 file log.c line 955 mctx 0x563a7308e610
add 0x7fefe4d5d1f0 size 32 file log.c line 955 mctx 0x563a7308e610
add 0x7fefe4d5d1f0 size 32 file log.c line 955 mctx 0x563a7308e610
add 0x7fefe4d5d210 size 32 file log.c line 955 mctx 0x563a7308e610
add 0x7fefe4d5d210 size 32 file log.c line 955 mctx 0x563a7308e610
add 0x7fefe4d5d230 size 32 file log.c line 955 mctx 0x563a7308e610
add 0x7fefe4d5d230 size 32 file log.c line 955 mctx 0x563a7308e610
add 0x7fefe4d5d250 size 32 file l
Job's log exceeded limit of 4194304 bytes.
failed
system:gcc:sid:amd64 System
add 0x7feba5ead0b8 size 56 file heap.c line 87 mctx 0x560152df3960
add 0x7feba5ead0b8 size 56 file heap.c line 87 mctx 0x560152df3960
add 0x7feba5ead0f0 size 56 file heap.c line 87 mctx 0x560152df3960
add 0x7feba5ead0f0 size 56 file heap.c line 87 mctx 0x560152df3960
add 0x7feba5ead128 size 56 file heap.c line 87 mctx 0x560152df3960
add 0x7feba5ead128 size 56 file heap.c line 87 mctx 0x560152df3960
add 0x7feba5ead160 size 56 file heap.c line 87 mctx 0x560152df3960
add 0x7feba5ead160 size 56 file heap.c line 87 mctx 0x560152df3960
add 0x7feba5ead198 size 56 file heap.c line 87
Job's log exceeded limit of 4194304 bytes.
failed
system:gcc:focal:amd64 System
add 0x7fc2575a72e8 size 56 file heap.c line 87 mctx 0x55e5dacb7710
add 0x7fc2575a72e8 size 56 file heap.c line 87 mctx 0x55e5dacb7710
add 0x7fc2575a7320 size 56 file heap.c line 87 mctx 0x55e5dacb7710
add 0x7fc2575a7320 size 56 file heap.c line 87 mctx 0x55e5dacb7710
add 0x7fc2575a7358 size 56 file heap.c line 87 mctx 0x55e5dacb7710
add 0x7fc2575a7358 size 56 file heap.c line 87 mctx 0x55e5dacb7710
add 0x7fc2575a7390 size 56 file heap.c line 87 mctx 0x55e5dacb7710
add 0x7fc2575a7390 size 56 file heap.c line 87 mctx 0x55e5dacb7710
add 0x7fc2575a73c8 size 56 file heap.c line 87
Job's log exceeded limit of 4194304 bytes.
failed
system:gcc:xenial:amd64 System
add 0x7f795f1f8010 size 32 file log.c line 955 mctx 0x2412fd0
add 0x7f795f1f8030 size 32 file log.c line 955 mctx 0x2412fd0
add 0x7f795f1f8030 size 32 file log.c line 955 mctx 0x2412fd0
add 0x7f795f1f8050 size 32 file log.c line 955 mctx 0x2412fd0
add 0x7f795f1f8050 size 32 file log.c line 955 mctx 0x2412fd0
add 0x7f795f1f8070 size 32 file log.c line 955 mctx 0x2412fd0
add 0x7f795f1f8070 size 32 file log.c line 955 mctx 0x2412fd0
add 0x7f795f1f8090 size 32 file log.c line 955 mctx 0x2412fd0
add
Job's log exceeded limit of 4194304 bytes.
failed
system:gcc:softhsm2.6 System
add 0x7f1a0c19b0d0 size 32 file log.c line 955 mctx 0x164be70
add 0x7f1a0c19b0d0 size 32 file log.c line 955 mctx 0x164be70
add 0x7f1a0c19b0f0 size 32 file log.c line 955 mctx 0x164be70
add 0x7f1a0c19b0f0 size 32 file log.c line 955 mctx 0x164be70
add 0x7f1a0c19b110 size 32 file log.c line 955 mctx 0x164be70
add 0x7f1a0c19b110 size 32 file log.c line 955 mctx 0x164be70
add 0x7f1a0c19b130 size 32 file log.c line 955 mctx 0x164be70
add 0x7f1a0c19b130 size 32 file log.c line 955 mctx 0x164be70
add 0x7f1a0c19b150 size 32 file
Job's log exceeded limit of 4194304 bytes.
failed
system:gcc:centos7:amd64 System
add 0x7fbf1abf5210 size 32 file log.c line 955 mctx 0x253e930
add 0x7fbf1abf5230 size 32 file log.c line 955 mctx 0x253e930
add 0x7fbf1abf5230 size 32 file log.c line 955 mctx 0x253e930
add 0x7fbf1abf5250 size 32 file log.c line 955 mctx 0x253e930
add 0x7fbf1abf5250 size 32 file log.c line 955 mctx 0x253e930
add 0x7fbf1abf5270 size 32 file log.c line 955 mctx 0x253e930
add 0x7fbf1abf5270 size 32 file log.c line 955 mctx 0x253e930
add 0x7fbf1abf5290 size 32 file log.c line 955 mctx 0x253e930
add 0x7f
Job's log exceeded limit of 4194304 bytes.
failed
system:gcc:tumbleweed:amd64 System
D:verify:add 0x7f6c8bfde150 size 80 file log.c line 668 mctx 0x1110910
D:verify:add 0x7f6c8bfde150 size 80 file log.c line 668 mctx 0x1110910
D:verify:add 0x7f6c8bfdf008 size 15 file log.c line 670 mctx 0x1110910
D:verify:add 0x7f6c8bfdf008 size 7 file log.c line 670 mctx 0x1110910
D:verify:add 0x7f6c8bfe1010 size 352 file log.c line 999 mctx 0x1110910
D:verify:add 0x7f6c8bfe1010 size 352 file log.c line 999 mctx 0x1110910
D:verify:del 0x7f6c8bfe0010 size 32 file log.c line 1007 mctx 0x1110910
D:verify:add 0x7f6c8bfe0010 size 32 file log.c line 955 mctx 0x1110910
D:verify:add 0x7f6c8
Job's log exceeded limit of 4194304 bytes.
failed
system:clang:tsan System
D:verify:add 0x7fa2c1c43240 size 32 file log.c line 955 mctx 0x7b44000003c0
D:verify:add 0x7fa2c1c43240 size 32 file log.c line 955 mctx 0x7b44000003c0
D:verify:add 0x7fa2c1c43260 size 32 file log.c line 955 mctx 0x7b44000003c0
D:verify:add 0x7fa2c1c43260 size 32 file log.c line 955 mctx 0x7b44000003c0
D:verify:add 0x7fa2c1c43280 size 32 file log.c line 955 mctx 0x7b44000003c0
D:verify:add 0x7fa2c1c43280 size 32 file log.c line 955 mctx 0x7b44000003c0
D:verify:add 0x7fa2c1c432a0 size 32 file log.c line 955 mctx 0x7b44000003c0
D:verify:add 0x7fa2c1c432a0 size 32 file log.c line 955 mctx 0x7b44000003c0
D:verify:add 0x7fa2c1c45000 size 248 file dst_api.c line 1462 mctx 0x7
Job's log exceeded limit of 4194304 bytes.
failed
system:gcc:alpine3.12:amd64 System
add 0x7f84c924e8e0 size 56 file heap.c line 87 mctx 0x563c40e1eea0
add 0x7f84c924e8e0 size 56 file heap.c line 87 mctx 0x563c40e1eea0
add 0x7f84c924e918 size 56 file heap.c line 87 mctx 0x563c40e1eea0
add 0x7f84c924e918 size 56 file heap.c line 87 mctx 0x563c40e1eea0
add 0x7f84c924e950 size 56 file heap.c line 87 mctx 0x563c40e1eea0
add 0x7f84c924e950 size 56 file heap.c line 87 mctx 0x563c40e1eea0
add 0x7f84c924e988 size 56 file heap.c line 87 mctx 0x563c40e1eea0
add 0x7f84c924e988 size 56 file heap.c line 87 mctx 0x563c40e1eea0
add 0x7f84c924e9c0 size 56 file heap.c line 87 mctx 0x563
Job's log exceeded limit of 4194304 bytes.
failed
system:gcc:tsan System
add 0x7f734d0270a0 size 32 file log.c line 955 mctx 0x7b44000003c0
add 0x7f734d0270c0 size 32 file log.c line 955 mctx 0x7b44000003c0
add 0x7f734d0270c0 size 32 file log.c line 955 mctx 0x7b44000003c0
add 0x7f734d0270e0 size 32 file log.c line 955 mctx 0x7b44000003c0
add 0x7f734d0270e0 size 32 file log.c line 955 mctx 0x7b44000003c0
add 0x7f734d027100 size 32 file log.c line 955 mctx 0x7b44000003c0
add 0x7f734d027100 size 32 file log.c line 955 mctx 0x7b44000003c0
add 0x7f734d027120 size 32 file log.c line 955 mctx 0x7b44000003c0
add 0x7f734d027120 size 32 file log.c li
Job's log exceeded limit of 4194304 bytes.
failed
scan-build Postcheck
scan-build: Analysis run complete.
scan-build: 5 bugs found.
scan-build: Run 'scan-view /builds/isc-projects/bind9/scan-build.reports/2021-02-04-193845-7208-1' to examine bug reports.
Uploading artifacts for failed job
Uploading artifacts...
scan-build.reports/: found 10 matching files and directories

Uploading artifacts as "archive" to coordinator... ok
id=1466084 responseStatus=201 Created token=baPyZNqP
Cleaning up file based variables
ERROR: Job failed: exit code 1
failed
unit:gcc:asan Unit
make[1]: Leaving directory '/builds/isc-projects/bind9/fuzz'
make: *** [Makefile:623: unit-recursive] Error 1
make: Target 'unit' not remade because of errors.
Uploading artifacts for failed job
Uploading artifacts...
untracked: found 1671 files

Uploading artifacts as "archive" to coordinator... ok
id=1466051 responseStatus=201 Created token=_ZjxceaE
Cleaning up file based variables
ERROR: Job failed: exit code 1
failed
unit:gcc:tsan Unit
Running after script...
$ find lib -name 'tsan.*' -exec python3 util/parse_tsan.py {} \;
Uploading artifacts for failed job
Uploading artifacts...
lib/*/tests/tsan.*: found 45 matching files and directories

tsan/: found 126 matching files and directories

Uploading artifacts as "archive" to coordinator... ok
id=1466053 responseStatus=201 Created token=up9dLs3B
Cleaning up file based variables
ERROR: Job failed: exit code 1
failed
unit:clang:asan Unit
make[1]: Leaving directory '/builds/isc-projects/bind9/fuzz'
make: *** [Makefile:623: unit-recursive] Error 1
make: Target 'unit' not remade because of errors.
Uploading artifacts for failed job
Uploading artifacts...
untracked: found 1574 files

Uploading artifacts as "archive" to coordinator... ok
id=1466052 responseStatus=201 Created token=o6kd4u5x
Cleaning up file based variables
ERROR: Job failed: exit code 1
failed
coccinelle Precheck
 		 * disabled.
*/
INSIST(0);
+ ISC_UNREACHABLE();
break;

default:
Cleaning up file based variables
ERROR: Job failed: exit code 1
failed
unit:gcc:buster:amd64 Unit
make[1]: Leaving directory '/builds/isc-projects/bind9/fuzz'
make: *** [Makefile:623: unit-recursive] Error 1
make: Target 'unit' not remade because of errors.
Uploading artifacts for failed job
Uploading artifacts...
untracked: found 2284 files

Uploading artifacts as "archive" to coordinator... ok
id=1466046 responseStatus=201 Created token=RkdwEsp5
Cleaning up file based variables
ERROR: Job failed: exit code 1
failed
unit:gcc:sid:amd64 Unit
make[1]: Leaving directory '/builds/isc-projects/bind9/fuzz'
make: *** [Makefile:623: unit-recursive] Error 1
make: Target 'unit' not remade because of errors.
Uploading artifacts for failed job
Uploading artifacts...
untracked: found 1964 files

Uploading artifacts as "archive" to coordinator... ok
id=1466047 responseStatus=201 Created token=Bj21h1ZF
Cleaning up file based variables
ERROR: Job failed: exit code 1
failed
unit:gcc:focal:amd64 Unit
make[1]: Leaving directory '/builds/isc-projects/bind9/fuzz'
make: *** [Makefile:623: unit-recursive] Error 1
make: Target 'unit' not remade because of errors.
Uploading artifacts for failed job
Uploading artifacts...
untracked: found 1643 files

Uploading artifacts as "archive" to coordinator... ok
id=1466050 responseStatus=201 Created token=W1moN5PR
Cleaning up file based variables
ERROR: Job failed: exit code 1
failed
unit:gcc:stretch:amd64 Unit
Makefile:623: recipe for target 'unit-recursive' failed
make: *** [unit-recursive] Error 1
make: Target 'unit' not remade because of errors.
Uploading artifacts for failed job
Uploading artifacts...
untracked: found 1643 files

Uploading artifacts as "archive" to coordinator... ok
id=1466045 responseStatus=201 Created token=9s3Day5y
Cleaning up file based variables
ERROR: Job failed: exit code 1
failed
unit:gcc:tumbleweed:amd64 Unit
make[1]: Leaving directory '/builds/isc-projects/bind9/fuzz'
make: *** [Makefile:623: unit-recursive] Error 1
make: Target 'unit' not remade because of errors.
Uploading artifacts for failed job
Uploading artifacts...
untracked: found 1643 files

Uploading artifacts as "archive" to coordinator... ok
id=1466048 responseStatus=201 Created token=SSoAF-RJ
Cleaning up file based variables
ERROR: Job failed: exit code 1
failed
unit:gcc:xenial:amd64 Unit
Makefile:623: recipe for target 'unit-recursive' failed
make: *** [unit-recursive] Error 1
make: Target 'unit' not remade because of errors.
Uploading artifacts for failed job
Uploading artifacts...
untracked: found 1747 files

Uploading artifacts as "archive" to coordinator... ok
id=1466049 responseStatus=201 Created token=7SNNggrs
Cleaning up file based variables
ERROR: Job failed: exit code 1
failed
unit:gcc:centos8:amd64 Unit
make[1]: Leaving directory '/builds/isc-projects/bind9/fuzz'
make: *** [Makefile:623: unit-recursive] Error 1
make: Target 'unit' not remade because of errors.
Uploading artifacts for failed job
Uploading artifacts...
untracked: found 1723 files

Uploading artifacts as "archive" to coordinator... ok
id=1466044 responseStatus=201 Created token=J_Evaz5A
Cleaning up file based variables
ERROR: Job failed: exit code 1
failed
unit:gcc:softhsm2.6 Unit
make[1]: Leaving directory '/builds/isc-projects/bind9/fuzz'
make: *** [Makefile:623: unit-recursive] Error 1
make: Target 'unit' not remade because of errors.
Uploading artifacts for failed job
Uploading artifacts...
untracked: found 1736 files

Uploading artifacts as "archive" to coordinator... ok
id=1466058 responseStatus=201 Created token=JR3y1PRT
Cleaning up file based variables
ERROR: Job failed: exit code 1
failed
unit:gcc:centos7:amd64 Unit
make[1]: Leaving directory `/builds/isc-projects/bind9/fuzz'
make: *** [unit-recursive] Error 1
make: Target `unit' not remade because of errors.
Uploading artifacts for failed job
Uploading artifacts...
untracked: found 1771 files

Uploading artifacts as "archive" to coordinator... ok
id=1466043 responseStatus=201 Created token=jAeyo_ix
Cleaning up file based variables
ERROR: Job failed: exit code 1
failed
unit:gcc:softhsm2.4 Unit
make[1]: Leaving directory '/builds/isc-projects/bind9/fuzz'
make: *** [Makefile:623: unit-recursive] Error 1
make: Target 'unit' not remade because of errors.
Uploading artifacts for failed job
Uploading artifacts...
untracked: found 1691 files

Uploading artifacts as "archive" to coordinator... ok
id=1466057 responseStatus=201 Created token=VCrgYBBy
Cleaning up file based variables
ERROR: Job failed: exit code 1
failed
unit:clang:freebsd11:amd64 Unit

make: stopped in /builds/isc-projects/bind9
Uploading artifacts for failed job
Uploading artifacts...
Runtime platform
arch=amd64 os=freebsd pid=18011 revision=775dd39d version=13.8.0
untracked: found 1563 files

Uploading artifacts as "archive" to coordinator... ok
id=1466059 responseStatus=201 Created token=re3cKXXc
Cleaning up file based variables
ERROR: Job failed: exit status 1
failed
unit:gcc:alpine3.12:amd64 Unit
make[1]: Leaving directory '/builds/isc-projects/bind9/fuzz'
make: *** [Makefile:623: unit-recursive] Error 1
make: Target 'unit' not remade because of errors.
Uploading artifacts for failed job
Uploading artifacts...
untracked: found 1740 files

Uploading artifacts as "archive" to coordinator... ok
id=1466042 responseStatus=201 Created token=-ve8kmMy
Cleaning up file based variables
ERROR: Job failed: exit code 1
failed
unit:clang:freebsd12:amd64 Unit

make[2]: stopped in /builds/isc-projects/bind9/fuzz
Uploading artifacts for failed job
Uploading artifacts...
Runtime platform
arch=amd64 os=freebsd pid=17222 revision=775dd39d version=13.8.0
untracked: found 1563 files

Uploading artifacts as "archive" to coordinator... ok
id=1466060 responseStatus=201 Created token=x_Xwt9ye
Cleaning up file based variables
ERROR: Job failed: exit status 1
failed
clang:openbsd:amd64 Build
Error target(s) unaccounted for: all-recursive 
Errors while building
*** Error 2 in target 'all', line 527 of Makefile (continuing)
Error target(s) unaccounted for: all
Running after_script
Running after script...
$ test -n "${OUT_OF_TREE_WORKSPACE}" && mv "${OUT_OF_TREE_WORKSPACE}" "${CI_PROJECT_DIR}"
Cleaning up file based variables
ERROR: Job failed: exit status 1
failed
unit:clang:tsan Unit
Running after script...
$ find lib -name 'tsan.*' -exec python3 util/parse_tsan.py {} \;
Uploading artifacts for failed job
Uploading artifacts...
lib/*/tests/tsan.*: found 26 matching files and directories

tsan/: found 54 matching files and directories

Uploading artifacts as "archive" to coordinator... ok
id=1466054 responseStatus=201 Created token=u1jgSmRh
Cleaning up file based variables
ERROR: Job failed: exit code 1
failed
unit:clang:buster:amd64 Unit
make[1]: Target 'unit' not remade because of errors.
make: *** [Makefile:623: unit-recursive] Error 1
make: Target 'unit' not remade because of errors.
Uploading artifacts for failed job
Uploading artifacts...
untracked: found 1577 files

Uploading artifacts as "archive" to coordinator... ok
id=1466056 responseStatus=201 Created token=Xtst8m8i
Cleaning up file based variables
ERROR: Job failed: exit code 1
failed
tarball-create Precheck
make[3]: *** [Makefile:908: mirror.zoneopt] Error 139
make[3]: Leaving directory '/builds/isc-projects/bind9/doc/misc'
make[2]: *** [Makefile:431: all-recursive] Error 1
make[2]: Leaving directory '/builds/isc-projects/bind9/doc'
make[1]: Leaving directory '/builds/isc-projects/bind9'
make[1]: *** [Makefile:623: all-recursive] Error 1
make: *** [Makefile:527: all] Error 2
Cleaning up file based variables
ERROR: Job failed: exit code 1
failed
gcc:mutexatomics Build
make[2]: Leaving directory '/builds/isc-projects/bind9/fuzz'
make[1]: Leaving directory '/builds/isc-projects/bind9'
make[1]: *** [Makefile:623: all-recursive] Error 1
make: *** [Makefile:527: all] Error 2
Running after_script
Running after script...
$ test -n "${OUT_OF_TREE_WORKSPACE}" && mv "${OUT_OF_TREE_WORKSPACE}" "${CI_PROJECT_DIR}"
Cleaning up file based variables
ERROR: Job failed: exit code 1
failed
msvc:windows:amd64 Build
Built:        2021-01-20T13:32:55+0000
OS/Arch: windows/amd64
Uploading artifacts...
Runtime platform
arch=amd64 os=windows pid=85308 revision=775dd39d version=13.8.0
untracked: found 268 files

Uploading artifacts as "archive" to coordinator... ok
id=1466041 responseStatus=201 Created token=NsEx3pgr
Cleaning up file based variables
Unsupported run stage "cleanup_file_variables"
ERROR: Job failed: exit status 1
failed
clang-format Precheck
$ if [ -r .clang-format ]; then "${CLANG_FORMAT}" -i -style=file $(git ls-files '*.c' '*.h'); fi
$ if test "$(git status --porcelain | grep -Ev '\?\?' | wc -l)" -gt "0"; then git status --short; exit 1; fi
M lib/isc/include/isc/mem.h
M lib/isc/mem.c
M lib/isc/netmgr/netmgr.c
M lib/isc/tests/mem_test.c
M lib/isc/tls.c
Cleaning up file based variables
ERROR: Job failed: exit code 1
failed
danger Precheck
 * branch            main       -> FETCH_HEAD



Failing the build, there are 4 fails.
Feedback: https://gitlab.isc.org/isc-projects/bind9/merge_requests/3858#note_147263

Cleaning up file based variables
ERROR: Job failed: exit code 1
failed
misc Precheck
Executing "step_script" stage of the job script
$ sh util/checklibs.sh > checklibs.out
Uploading artifacts for failed job
Uploading artifacts...
WARNING: util/newcopyrights: no matching files
checklibs.out: found 1 matching files and directories

Uploading artifacts as "archive" to coordinator... ok
id=1466015 responseStatus=201 Created token=wQHprQVL
Cleaning up file based variables
ERROR: Job failed: exit code 1