Set SYSTEMTESTTOP in eddsa ns3 sign script

eddsa/ns3/sign.sh script failed to set SYSTEMTESTTOP environmental
variable in 4538d8dd. Failing to set the
variable in scripts deeper than in root of system test fails to
correctly set TOP variable in conf.sh.win32 and thus fails to source
conf.sh.common.
78 jobs for !4693 with mnowak/fix-eddsa in 21 minutes and 45 seconds (queued for 17 seconds)
detached
Status Job ID Name Coverage
  Precheck
passed #1497768
amd64 linux
autoreconf

00:00:18

passed #1497770
amd64 linux
clang-format

00:00:20

passed #1497771
amd64 linux
coccinelle

00:03:42

passed #1497772
amd64 linux
danger

00:00:18

passed #1497769
amd64 linux
misc

00:00:16

 
  Build
passed #1497786
amd64 linux
clang:asan

00:04:00

passed #1497790
amd64 linux
clang:buster:amd64

00:02:31

passed #1497793
amd64 libvirt
clang:freebsd11:amd64

00:02:27

passed #1497794
amd64 libvirt
clang:freebsd12:amd64

00:02:18

passed #1497795
amd64 libvirt
clang:openbsd:amd64

00:04:03

passed #1497788
amd64 linux
clang:tsan

00:02:29

passed #1497773
amd64 linux
gcc:alpine3.12:amd64

00:02:10

passed #1497785
amd64 linux
gcc:asan

00:03:32

passed #1497777
amd64 linux
gcc:buster:amd64

00:01:43

passed #1497774
amd64 linux
gcc:centos7:amd64

00:02:20

passed #1497775
amd64 linux
gcc:centos8:amd64

00:02:05

passed #1497784
amd64 linux
gcc:focal:amd64

00:02:10

passed #1497789
amd64 linux
gcc:mutexatomics

00:02:32

passed #1497779
amd64 linux
gcc:out-of-tree

00:01:47

passed #1497778
amd64 linux
gcc:sid:amd64

00:02:03

passed #1497780
i386 linux
gcc:sid:i386

00:01:46

passed #1497791
amd64 linux
gcc:softhsm2.4

00:01:58

passed #1497792
amd64 linux
gcc:softhsm2.6

00:02:31

passed #1497776
amd64 linux
gcc:stretch:amd64

00:02:20

passed #1497787
amd64 linux
gcc:tsan

00:02:02

passed #1497781
amd64 linux
gcc:tumbleweed:amd64

00:02:07

passed #1497782
amd64 linux
gcc:xenial:amd64

00:02:06

passed #1497797
amd64 windows
msvc:windows:amd64

00:01:52

passed #1497796
amd64 linux
nolibtool:sid:amd64

00:02:11

 
  Unit
passed #1497809
amd64 linux
unit:clang:asan

00:00:53

passed #1497813
amd64 linux
unit:clang:buster:amd64

00:00:41

passed #1497816
amd64 libvirt
unit:clang:freebsd11:amd64

00:01:07

passed #1497817
amd64 libvirt
unit:clang:freebsd12:amd64

00:00:59

passed #1497811
amd64 linux
unit:clang:tsan

00:01:29

passed #1497798
amd64 linux
unit:gcc:alpine3.12:amd64

00:00:55

passed #1497808
amd64 linux
unit:gcc:asan

00:00:50

passed #1497802
amd64 linux
unit:gcc:buster:amd64

00:01:05

passed #1497799
amd64 linux
unit:gcc:centos7:amd64

00:00:45

passed #1497800
amd64 linux
unit:gcc:centos8:amd64

00:00:41

passed #1497807
amd64 linux
unit:gcc:focal:amd64

00:00:36

passed #1497812
amd64 linux
unit:gcc:mutexatomics

00:00:43

passed #1497803
amd64 linux
unit:gcc:sid:amd64

00:00:38

passed #1497804
i386 linux
unit:gcc:sid:i386

00:00:45

passed #1497814
amd64 linux
unit:gcc:softhsm2.4

00:00:36

passed #1497815
amd64 linux
unit:gcc:softhsm2.6

00:00:42

passed #1497801
amd64 linux
unit:gcc:stretch:amd64

00:00:43

passed #1497810
amd64 linux
unit:gcc:tsan

00:01:55

passed #1497805
amd64 linux
unit:gcc:tumbleweed:amd64

00:00:35

passed #1497806
amd64 linux
unit:gcc:xenial:amd64

00:00:39

passed #1497818
amd64 linux
unit:nolibtool:sid:amd64

00:00:54

 
  System
failed #1497830
amd64 linux
system:clang:asan

00:12:41

passed #1497834
amd64 linux
system:clang:buster:amd64

00:11:25

passed #1497837
amd64 libvirt
system:clang:freebsd11:amd64

00:10:34

failed #1497838
amd64 libvirt
system:clang:freebsd12:amd64

00:10:44

passed #1497832
amd64 linux
system:clang:tsan

00:14:09

passed #1497819
amd64 linux
system:gcc:alpine3.12:amd64

00:12:03

passed #1497829
amd64 linux
system:gcc:asan

00:13:06

failed #1497823
amd64 linux
system:gcc:buster:amd64

00:12:26

passed #1497820
amd64 linux
system:gcc:centos7:amd64

00:11:56

passed #1497821
amd64 linux
system:gcc:centos8:amd64

00:12:21

passed #1497828
amd64 linux
system:gcc:focal:amd64

00:11:05

passed #1497833
amd64 linux
system:gcc:mutexatomics

00:11:00

passed #1497824
amd64 linux
system:gcc:sid:amd64

00:11:06

passed #1497825
i386 linux
system:gcc:sid:i386

00:10:02

passed #1497835
amd64 linux
system:gcc:softhsm2.4

00:11:43

failed #1497836
amd64 linux
system:gcc:softhsm2.6

00:12:10

passed #1497822
amd64 linux
system:gcc:stretch:amd64

00:10:45

passed #1497831
amd64 linux
system:gcc:tsan

00:14:41

passed #1497826
amd64 linux
system:gcc:tumbleweed:amd64

00:11:47

passed #1497827
amd64 linux
system:gcc:xenial:amd64

00:10:46

passed #1497839
amd64 linux
system:nolibtool:sid:amd64

00:11:49

 
  Docs
passed #1497943
amd64 linux
docs

00:02:16

failed #1497840
amd64 linux
docs

00:02:27

 
  Postcheck
passed #1497844
amd64 linux
cppcheck

00:00:22

passed #1497841
amd64 linux
flake8

00:00:31

skipped #1497845
amd64 linux
gcov
passed #1497842
amd64 linux
pylint

00:00:25

passed #1497843
amd64 linux
scan-build

00:09:40

 
Name Stage Failure
failed
system:clang:asan System
I:The following system tests failed:
I: kasp
make: *** [Makefile:489: test] Error 1
Uploading artifacts for failed job
Uploading artifacts...
untracked: found 4629 files

Uploading artifacts as "archive" to coordinator... ok
id=1497830 responseStatus=201 Created token=9rxnksTM
Cleaning up file based variables
ERROR: Job failed: exit code 1
failed
system:gcc:buster:amd64 System
I:The following system tests failed:
I: kasp
make: *** [Makefile:489: test] Error 1
Uploading artifacts for failed job
Uploading artifacts...
untracked: found 5561 files

Uploading artifacts as "archive" to coordinator... ok
id=1497823 responseStatus=201 Created token=cXptQPyx
Cleaning up file based variables
ERROR: Job failed: exit code 1
failed
system:gcc:softhsm2.6 System
I:The following system tests failed:
I: kasp
make: *** [Makefile:489: test] Error 1
Uploading artifacts for failed job
Uploading artifacts...
untracked: found 4705 files

Uploading artifacts as "archive" to coordinator... ok
id=1497836 responseStatus=201 Created token=4sD9snN8
Cleaning up file based variables
ERROR: Job failed: exit code 1
failed
system:clang:freebsd12:amd64 System

make: stopped in /builds/isc-projects/bind9/bin/tests/system
Uploading artifacts for failed job
Uploading artifacts...
Runtime platform
arch=amd64 os=freebsd pid=72964 revision=775dd39d version=13.8.0
untracked: found 1488 files

Uploading artifacts as "archive" to coordinator... ok
id=1497838 responseStatus=201 Created token=5vr6m8yk
Cleaning up file based variables
ERROR: Job failed: exit status 1