Set SYSTEMTESTTOP in eddsa ns3 sign script

eddsa/ns3/sign.sh script failed to set SYSTEMTESTTOP environmental
variable in 4538d8dd. Failing to set the
variable in scripts deeper than in root of system test fails to
correctly set TOP variable in conf.sh.win32 and thus fails to source
conf.sh.common.
78 jobs for !4693 with mnowak/fix-eddsa in 21 minutes and 45 seconds (queued for 17 seconds)
detached
Status Job ID Name Coverage
  Precheck
passed #1497768
linux amd64
autoreconf

00:00:18

passed #1497770
linux amd64
clang-format

00:00:20

passed #1497771
linux amd64
coccinelle

00:03:42

passed #1497772
linux amd64
danger

00:00:18

passed #1497769
linux amd64
misc

00:00:16

 
  Build
passed #1497786
linux amd64
clang:asan

00:04:00

passed #1497790
linux amd64
clang:buster:amd64

00:02:31

passed #1497793
amd64 libvirt
clang:freebsd11:amd64

00:02:27

passed #1497794
amd64 libvirt
clang:freebsd12:amd64

00:02:18

passed #1497795
amd64 libvirt
clang:openbsd:amd64

00:04:03

passed #1497788
linux amd64
clang:tsan

00:02:29

passed #1497773
linux amd64
gcc:alpine3.12:amd64

00:02:10

passed #1497785
linux amd64
gcc:asan

00:03:32

passed #1497777
linux amd64
gcc:buster:amd64

00:01:43

passed #1497774
linux amd64
gcc:centos7:amd64

00:02:20

passed #1497775
linux amd64
gcc:centos8:amd64

00:02:05

passed #1497784
linux amd64
gcc:focal:amd64

00:02:10

passed #1497789
linux amd64
gcc:mutexatomics

00:02:32

passed #1497779
linux amd64
gcc:out-of-tree

00:01:47

passed #1497778
linux amd64
gcc:sid:amd64

00:02:03

passed #1497780
linux i386
gcc:sid:i386

00:01:46

passed #1497791
linux amd64
gcc:softhsm2.4

00:01:58

passed #1497792
linux amd64
gcc:softhsm2.6

00:02:31

passed #1497776
linux amd64
gcc:stretch:amd64

00:02:20

passed #1497787
linux amd64
gcc:tsan

00:02:02

passed #1497781
linux amd64
gcc:tumbleweed:amd64

00:02:07

passed #1497782
linux amd64
gcc:xenial:amd64

00:02:06

passed #1497797
amd64 windows
msvc:windows:amd64

00:01:52

passed #1497796
linux amd64
nolibtool:sid:amd64

00:02:11

 
  Unit
passed #1497809
linux amd64
unit:clang:asan

00:00:53

passed #1497813
linux amd64
unit:clang:buster:amd64

00:00:41

passed #1497816
amd64 libvirt
unit:clang:freebsd11:amd64

00:01:07

passed #1497817
amd64 libvirt
unit:clang:freebsd12:amd64

00:00:59

passed #1497811
linux amd64
unit:clang:tsan

00:01:29

passed #1497798
linux amd64
unit:gcc:alpine3.12:amd64

00:00:55

passed #1497808
linux amd64
unit:gcc:asan

00:00:50

passed #1497802
linux amd64
unit:gcc:buster:amd64

00:01:05

passed #1497799
linux amd64
unit:gcc:centos7:amd64

00:00:45

passed #1497800
linux amd64
unit:gcc:centos8:amd64

00:00:41

passed #1497807
linux amd64
unit:gcc:focal:amd64

00:00:36

passed #1497812
linux amd64
unit:gcc:mutexatomics

00:00:43

passed #1497803
linux amd64
unit:gcc:sid:amd64

00:00:38

passed #1497804
linux i386
unit:gcc:sid:i386

00:00:45

passed #1497814
linux amd64
unit:gcc:softhsm2.4

00:00:36

passed #1497815
linux amd64
unit:gcc:softhsm2.6

00:00:42

passed #1497801
linux amd64
unit:gcc:stretch:amd64

00:00:43

passed #1497810
linux amd64
unit:gcc:tsan

00:01:55

passed #1497805
linux amd64
unit:gcc:tumbleweed:amd64

00:00:35

passed #1497806
linux amd64
unit:gcc:xenial:amd64

00:00:39

passed #1497818
linux amd64
unit:nolibtool:sid:amd64

00:00:54

 
  System
failed #1497830
linux amd64
system:clang:asan

00:12:41

passed #1497834
linux amd64
system:clang:buster:amd64

00:11:25

passed #1497837
amd64 libvirt
system:clang:freebsd11:amd64

00:10:34

failed #1497838
amd64 libvirt
system:clang:freebsd12:amd64

00:10:44

passed #1497832
linux amd64
system:clang:tsan

00:14:09

passed #1497819
linux amd64
system:gcc:alpine3.12:amd64

00:12:03

passed #1497829
linux amd64
system:gcc:asan

00:13:06

failed #1497823
linux amd64
system:gcc:buster:amd64

00:12:26

passed #1497820
linux amd64
system:gcc:centos7:amd64

00:11:56

passed #1497821
linux amd64
system:gcc:centos8:amd64

00:12:21

passed #1497828
linux amd64
system:gcc:focal:amd64

00:11:05

passed #1497833
linux amd64
system:gcc:mutexatomics

00:11:00

passed #1497824
linux amd64
system:gcc:sid:amd64

00:11:06

passed #1497825
linux i386
system:gcc:sid:i386

00:10:02

passed #1497835
linux amd64
system:gcc:softhsm2.4

00:11:43

failed #1497836
linux amd64
system:gcc:softhsm2.6

00:12:10

passed #1497822
linux amd64
system:gcc:stretch:amd64

00:10:45

passed #1497831
linux amd64
system:gcc:tsan

00:14:41

passed #1497826
linux amd64
system:gcc:tumbleweed:amd64

00:11:47

passed #1497827
linux amd64
system:gcc:xenial:amd64

00:10:46

passed #1497839
linux amd64
system:nolibtool:sid:amd64

00:11:49

 
  Docs
passed #1497943
linux amd64
docs

00:02:16

failed #1497840
linux amd64
docs

00:02:27

 
  Postcheck
passed #1497844
linux amd64
cppcheck

00:00:22

passed #1497841
linux amd64
flake8

00:00:31

skipped #1497845
linux amd64
gcov
passed #1497842
linux amd64
pylint

00:00:25

passed #1497843
linux amd64
scan-build

00:09:40

 
Name Stage Failure
failed
system:clang:asan System
I:The following system tests failed:
I: kasp
make: *** [Makefile:489: test] Error 1
Uploading artifacts for failed job
Uploading artifacts...
untracked: found 4629 files

Uploading artifacts as "archive" to coordinator... ok
id=1497830 responseStatus=201 Created token=9rxnksTM
Cleaning up file based variables
ERROR: Job failed: exit code 1
failed
system:gcc:buster:amd64 System
I:The following system tests failed:
I: kasp
make: *** [Makefile:489: test] Error 1
Uploading artifacts for failed job
Uploading artifacts...
untracked: found 5561 files

Uploading artifacts as "archive" to coordinator... ok
id=1497823 responseStatus=201 Created token=cXptQPyx
Cleaning up file based variables
ERROR: Job failed: exit code 1
failed
system:gcc:softhsm2.6 System
I:The following system tests failed:
I: kasp
make: *** [Makefile:489: test] Error 1
Uploading artifacts for failed job
Uploading artifacts...
untracked: found 4705 files

Uploading artifacts as "archive" to coordinator... ok
id=1497836 responseStatus=201 Created token=4sD9snN8
Cleaning up file based variables
ERROR: Job failed: exit code 1
failed
system:clang:freebsd12:amd64 System

make: stopped in /builds/isc-projects/bind9/bin/tests/system
Uploading artifacts for failed job
Uploading artifacts...
Runtime platform
arch=amd64 os=freebsd pid=72964 revision=775dd39d version=13.8.0
untracked: found 1488 files

Uploading artifacts as "archive" to coordinator... ok
id=1497838 responseStatus=201 Created token=5vr6m8yk
Cleaning up file based variables
ERROR: Job failed: exit status 1