fixup! Convert isc_result_t to an enum type

73 jobs for !4743 with 719-make-isc_results-static in 18 minutes and 36 seconds (queued for 7 seconds)
detached
Status Job ID Name Coverage
  Autoconf
passed #1542097
amd64 linux
autoreconf

00:00:18

 
  Precheck
passed #1542099
amd64 linux
clang-format

00:00:17

passed #1542100
amd64 linux
coccinelle

00:04:03

failed #1542101
amd64 linux
danger

00:00:16

passed #1542098
amd64 linux
misc

00:00:18

passed #1542102
amd64 linux
tarball-create

00:01:30

 
  Build
passed #1542114
amd64 linux
clang:asan

00:02:12

passed #1542118
amd64 linux
clang:buster:amd64

00:00:52

passed #1542121
amd64 libvirt
clang:freebsd11:amd64

00:01:14

passed #1542122
amd64 libvirt
clang:freebsd12:amd64

00:01:13

passed #1542123
amd64 libvirt
clang:openbsd:amd64

00:02:38

passed #1542116
amd64 linux
clang:tsan

00:01:18

passed #1542103
amd64 linux
gcc:alpine3.13:amd64

00:01:07

passed #1542113
amd64 linux
gcc:asan

00:01:50

passed #1542107
amd64 linux
gcc:buster:amd64

00:00:43

passed #1542104
amd64 linux
gcc:centos7:amd64

00:01:04

passed #1542105
amd64 linux
gcc:centos8:amd64

00:01:04

passed #1542112
amd64 linux
gcc:focal:amd64

00:01:02

passed #1542117
amd64 linux
gcc:mutexatomics

00:00:53

passed #1542109
amd64 linux
gcc:out-of-tree

00:01:08

passed #1542108
amd64 linux
gcc:sid:amd64

00:01:16

passed #1542119
amd64 linux
gcc:softhsm2.4

00:00:54

passed #1542120
amd64 linux
gcc:softhsm2.6

00:01:03

passed #1542106
amd64 linux
gcc:stretch:amd64

00:00:58

passed #1542115
amd64 linux
gcc:tsan

00:01:12

passed #1542110
amd64 linux
gcc:tumbleweed:amd64

00:01:05

passed #1542111
amd64 linux
gcc:xenial:amd64

00:01:01

passed #1542124
amd64 windows
msvc:windows:amd64

00:00:44

 
  Unit
passed #1542135
amd64 linux
unit:clang:asan

00:01:36

passed #1542139
amd64 linux
unit:clang:buster:amd64

00:01:14

passed #1542142
amd64 libvirt
unit:clang:freebsd11:amd64

00:01:48

passed #1542143
amd64 libvirt
unit:clang:freebsd12:amd64

00:01:39

passed #1542144
amd64 libvirt
unit:clang:openbsd:amd64

00:03:25

passed #1542137
amd64 linux
unit:clang:tsan

00:03:21

passed #1542125
amd64 linux
unit:gcc:alpine3.13:amd64

00:01:18

failed #1542134
amd64 linux
unit:gcc:asan

00:01:42

passed #1542129
amd64 linux
unit:gcc:buster:amd64

00:02:13

failed #1542126
amd64 linux
unit:gcc:centos7:amd64

00:01:23

passed #1542127
amd64 linux
unit:gcc:centos8:amd64

00:01:14

passed #1542133
amd64 linux
unit:gcc:focal:amd64

00:01:16

failed #1542138
amd64 linux
unit:gcc:mutexatomics

00:01:26

passed #1542130
amd64 linux
unit:gcc:sid:amd64

00:01:13

passed #1542140
amd64 linux
unit:gcc:softhsm2.4

00:01:20

passed #1542141
amd64 linux
unit:gcc:softhsm2.6

00:01:15

passed #1542128
amd64 linux
unit:gcc:stretch:amd64

00:01:13

passed #1542136
amd64 linux
unit:gcc:tsan

00:04:00

passed #1542131
amd64 linux
unit:gcc:tumbleweed:amd64

00:01:16

passed #1542132
amd64 linux
unit:gcc:xenial:amd64

00:01:16

 
  System
failed #1542155
amd64 linux
system:clang:asan

00:13:57

passed #1542159
amd64 linux
system:clang:buster:amd64

00:12:05

passed #1542162
amd64 libvirt
system:clang:freebsd11:amd64

00:12:19

failed #1542163
amd64 libvirt
system:clang:freebsd12:amd64

00:12:07

failed #1542157
amd64 linux allowed to fail
system:clang:tsan

00:15:53

passed #1542145
amd64 linux
system:gcc:alpine3.13:amd64

00:12:45

passed #1542154
amd64 linux
system:gcc:asan

00:13:54

passed #1542149
amd64 linux
system:gcc:buster:amd64

00:13:14

passed #1542146
amd64 linux
system:gcc:centos7:amd64

00:12:12

passed #1542147
amd64 linux
system:gcc:centos8:amd64

00:13:10

passed #1542153
amd64 linux
system:gcc:focal:amd64

00:12:45

passed #1542158
amd64 linux
system:gcc:mutexatomics

00:11:55

passed #1542150
amd64 linux
system:gcc:sid:amd64

00:12:09

passed #1542160
amd64 linux
system:gcc:softhsm2.4

00:12:08

failed #1542161
amd64 linux
system:gcc:softhsm2.6

00:13:10

passed #1542148
amd64 linux
system:gcc:stretch:amd64

00:11:43

failed #1542156
amd64 linux allowed to fail
system:gcc:tsan

00:15:55

passed #1542151
amd64 linux
system:gcc:tumbleweed:amd64

00:12:30

passed #1542152
amd64 linux
system:gcc:xenial:amd64

00:11:08

 
  Docs
passed #1542164
amd64 linux
docs

00:00:54

 
  Postcheck
failed #1542168
amd64 linux
cppcheck

00:00:56

passed #1542165
amd64 linux
flake8

00:00:22

passed #1542169
amd64 linux
gcov

00:00:33

76.0%
passed #1542166
amd64 linux
pylint

00:00:24

passed #1542167
amd64 linux
scan-build

00:04:22

 
Name Stage Failure
failed
system:clang:tsan System
FAIL pipelined (exit status: 1)

$ find bin -name 'tsan.*' -exec python3 util/parse_tsan.py {} \;
Uploading artifacts for failed job
Uploading artifacts...
untracked: found 1737 files

Uploading artifacts as "archive" to coordinator... ok
id=1542157 responseStatus=201 Created token=H4GM7_oM
Cleaning up file based variables
ERROR: Job failed: exit code 1
failed
system:gcc:tsan System
FAIL pipelined (exit status: 1)

$ find bin -name 'tsan.*' -exec python3 util/parse_tsan.py {} \;
Uploading artifacts for failed job
Uploading artifacts...
untracked: found 1717 files

Uploading artifacts as "archive" to coordinator... ok
id=1542156 responseStatus=201 Created token=b5m6UKRX
Cleaning up file based variables
ERROR: Job failed: exit code 1
failed
system:clang:asan System
FAIL kasp (exit status: 1)

$ test -n "${OUT_OF_TREE_WORKSPACE}" && mv "${OUT_OF_TREE_WORKSPACE}" "${CI_PROJECT_DIR}"
Uploading artifacts for failed job
Uploading artifacts...
untracked: found 4806 files

Uploading artifacts as "archive" to coordinator... ok
id=1542155 responseStatus=201 Created token=hn1jKnW8
Cleaning up file based variables
ERROR: Job failed: exit code 1
failed
system:gcc:softhsm2.6 System
FAIL dnssec (exit status: 1)

$ test -n "${OUT_OF_TREE_WORKSPACE}" && mv "${OUT_OF_TREE_WORKSPACE}" "${CI_PROJECT_DIR}"
Uploading artifacts for failed job
Uploading artifacts...
untracked: found 2853 files

Uploading artifacts as "archive" to coordinator... ok
id=1542161 responseStatus=201 Created token=y1LKsnei
Cleaning up file based variables
ERROR: Job failed: exit code 1
failed
system:clang:freebsd12:amd64 System

$ test -n "${OUT_OF_TREE_WORKSPACE}" && mv "${OUT_OF_TREE_WORKSPACE}" "${CI_PROJECT_DIR}"
Uploading artifacts for failed job
Uploading artifacts...
Runtime platform
arch=amd64 os=freebsd pid=77068 revision=2ebc4dc4 version=13.9.0
untracked: found 1483 files

Uploading artifacts as "archive" to coordinator... ok
id=1542163 responseStatus=201 Created token=VhzSaYze
Cleaning up file based variables
ERROR: Job failed: exit status 1
failed
unit:gcc:asan Unit
make[1]: Leaving directory '/builds/isc-projects/bind9/fuzz'
make: *** [Makefile:608: unit-recursive] Error 1
make: Target 'unit' not remade because of errors.
Uploading artifacts for failed job
Uploading artifacts...
untracked: found 1618 files

Uploading artifacts as "archive" to coordinator... ok
id=1542134 responseStatus=201 Created token=6HzBhGxh
Cleaning up file based variables
ERROR: Job failed: exit code 1
failed
unit:gcc:centos7:amd64 Unit
make[1]: Leaving directory `/builds/isc-projects/bind9/fuzz'
make: *** [unit-recursive] Error 1
make: Target `unit' not remade because of errors.
Uploading artifacts for failed job
Uploading artifacts...
untracked: found 1682 files

Uploading artifacts as "archive" to coordinator... ok
id=1542126 responseStatus=201 Created token=n8vcCtQA
Cleaning up file based variables
ERROR: Job failed: exit code 1
failed
unit:gcc:mutexatomics Unit
make[1]: Leaving directory '/builds/isc-projects/bind9/fuzz'
make: *** [Makefile:608: unit-recursive] Error 1
make: Target 'unit' not remade because of errors.
Uploading artifacts for failed job
Uploading artifacts...
untracked: found 1618 files

Uploading artifacts as "archive" to coordinator... ok
id=1542138 responseStatus=201 Created token=hFmB6ua7
Cleaning up file based variables
ERROR: Job failed: exit code 1
failed
cppcheck Postcheck
Open 'cppcheck_html//index.html' to see the results.
Uploading artifacts for failed job
Uploading artifacts...
compile_commands.json: found 1 matching files and directories

cppcheck.results: found 1 matching files and directories

cppcheck_html/: found 5 matching files and directories

Uploading artifacts as "archive" to coordinator... ok
id=1542168 responseStatus=201 Created token=H7uePyya
Cleaning up file based variables
ERROR: Job failed: exit code 1
failed
danger Precheck
 * branch            main       -> FETCH_HEAD



Failing the build, there are 2 fails.
Feedback: https://gitlab.isc.org/isc-projects/bind9/merge_requests/4743#note_196744

Cleaning up file based variables
ERROR: Job failed: exit code 1