Remove generated files to make distcheck pass

72 jobs for !4114 with 1880-fix-make-distcheck in 11 minutes and 47 seconds (queued for 24 seconds)
latest detached
Status Job ID Name Coverage
  Autoconf
passed #1624094
linux amd64
autoreconf

00:00:17

canceled #1623961
linux amd64
autoreconf

00:00:09

 
  Precheck
canceled #1623963
linux amd64
clang-format

00:00:09

canceled #1623964
linux amd64
coccinelle

00:00:08

canceled #1623965
linux amd64
danger

00:00:07

canceled #1623962
linux amd64
misc

00:00:08

failed #1624102
linux amd64
tarball-create

00:11:19

canceled #1623966
linux amd64
tarball-create

 
  Build
canceled #1623977
linux amd64
clang:asan

canceled #1623981
linux amd64
clang:buster:amd64

canceled #1623984
amd64 libvirt
clang:freebsd11:amd64

canceled #1623985
amd64 libvirt
clang:freebsd12:amd64

canceled #1623986
amd64 libvirt
clang:openbsd:amd64

canceled #1623979
linux amd64
clang:tsan

canceled #1623967
linux amd64
gcc:alpine3.13:amd64

canceled #1623976
linux amd64
gcc:asan

canceled #1623971
linux amd64
gcc:buster:amd64

canceled #1623968
linux amd64
gcc:centos7:amd64

canceled #1623969
linux amd64
gcc:centos8:amd64

canceled #1623975
linux amd64
gcc:focal:amd64

canceled #1623980
linux amd64
gcc:mutexatomics

canceled #1623973
linux amd64
gcc:out-of-tree

canceled #1623972
linux amd64
gcc:sid:amd64

canceled #1623982
linux amd64
gcc:softhsm2.4

canceled #1623983
linux amd64
gcc:softhsm2.6

canceled #1623970
linux amd64
gcc:stretch:amd64

canceled #1623978
linux amd64
gcc:tsan

canceled #1623974
linux amd64
gcc:tumbleweed:amd64

canceled #1623987
amd64 windows
msvc:windows:amd64

00:00:06

 
  Unit
canceled #1623997
linux amd64
unit:clang:asan

canceled #1624001
linux amd64
unit:clang:buster:amd64

canceled #1624004
amd64 libvirt
unit:clang:freebsd11:amd64

canceled #1624005
amd64 libvirt
unit:clang:freebsd12:amd64

canceled #1624006
amd64 libvirt
unit:clang:openbsd:amd64

canceled #1623999
linux amd64
unit:clang:tsan

canceled #1623988
linux amd64
unit:gcc:alpine3.13:amd64

canceled #1623996
linux amd64
unit:gcc:asan

canceled #1623992
linux amd64
unit:gcc:buster:amd64

canceled #1623989
linux amd64
unit:gcc:centos7:amd64

canceled #1623990
linux amd64
unit:gcc:centos8:amd64

canceled #1623995
linux amd64
unit:gcc:focal:amd64

canceled #1624000
linux amd64
unit:gcc:mutexatomics

canceled #1623993
linux amd64
unit:gcc:sid:amd64

canceled #1624002
linux amd64
unit:gcc:softhsm2.4

canceled #1624003
linux amd64
unit:gcc:softhsm2.6

canceled #1623991
linux amd64
unit:gcc:stretch:amd64

canceled #1623998
linux amd64
unit:gcc:tsan

canceled #1623994
linux amd64
unit:gcc:tumbleweed:amd64

 
  System
canceled #1624016
linux amd64
system:clang:asan

canceled #1624020
linux amd64
system:clang:buster:amd64

canceled #1624023
amd64 libvirt
system:clang:freebsd11:amd64

canceled #1624024
amd64 libvirt
system:clang:freebsd12:amd64

canceled #1624018
linux amd64
system:clang:tsan

canceled #1624007
linux amd64
system:gcc:alpine3.13:amd64

canceled #1624015
linux amd64
system:gcc:asan

canceled #1624011
linux amd64
system:gcc:buster:amd64

canceled #1624008
linux amd64
system:gcc:centos7:amd64

canceled #1624009
linux amd64
system:gcc:centos8:amd64

canceled #1624014
linux amd64
system:gcc:focal:amd64

canceled #1624019
linux amd64
system:gcc:mutexatomics

canceled #1624012
linux amd64
system:gcc:sid:amd64

canceled #1624021
linux amd64
system:gcc:softhsm2.4

canceled #1624022
linux amd64
system:gcc:softhsm2.6

canceled #1624010
linux amd64
system:gcc:stretch:amd64

canceled #1624017
linux amd64
system:gcc:tsan

canceled #1624013
linux amd64
system:gcc:tumbleweed:amd64

 
  Docs
canceled #1624025
linux amd64
docs

 
  Postcheck
canceled #1624029
linux amd64
cppcheck

canceled #1624026
linux amd64
flake8

canceled #1624030
linux amd64
gcov

canceled #1624027
linux amd64
pylint

canceled #1624028
linux amd64
scan-build

 
Name Stage Failure
failed
tarball-create Precheck
make[3]: *** [Makefile:722: distdir-am] Error 1
make[3]: Leaving directory '/builds/isc-projects/bind9/bind-9.17.11/_build/sub'
make[2]: Leaving directory '/builds/isc-projects/bind9/bind-9.17.11/_build/sub'
make[2]: *** [Makefile:716: distdir] Error 2
make[1]: *** [Makefile:820: dist] Error 2
make[1]: Leaving directory '/builds/isc-projects/bind9/bind-9.17.11/_build/sub'
make: *** [Makefile:832: distcheck] Error 1
Cleaning up file based variables
ERROR: Job failed: exit code 1