Remove generated files to make distcheck pass

72 jobs for !4114 with 1880-fix-make-distcheck in 11 minutes and 47 seconds (queued for 24 seconds)
latest detached
Status Job ID Name Coverage
  Autoconf
passed #1624094
amd64 linux
autoreconf

00:00:17

canceled #1623961
amd64 linux
autoreconf

00:00:09

 
  Precheck
canceled #1623963
amd64 linux
clang-format

00:00:09

canceled #1623964
amd64 linux
coccinelle

00:00:08

canceled #1623965
amd64 linux
danger

00:00:07

canceled #1623962
amd64 linux
misc

00:00:08

failed #1624102
amd64 linux
tarball-create

00:11:19

canceled #1623966
amd64 linux
tarball-create

 
  Build
canceled #1623977
amd64 linux
clang:asan

canceled #1623981
amd64 linux
clang:buster:amd64

canceled #1623984
amd64 libvirt
clang:freebsd11:amd64

canceled #1623985
amd64 libvirt
clang:freebsd12:amd64

canceled #1623986
amd64 libvirt
clang:openbsd:amd64

canceled #1623979
amd64 linux
clang:tsan

canceled #1623967
amd64 linux
gcc:alpine3.13:amd64

canceled #1623976
amd64 linux
gcc:asan

canceled #1623971
amd64 linux
gcc:buster:amd64

canceled #1623968
amd64 linux
gcc:centos7:amd64

canceled #1623969
amd64 linux
gcc:centos8:amd64

canceled #1623975
amd64 linux
gcc:focal:amd64

canceled #1623980
amd64 linux
gcc:mutexatomics

canceled #1623973
amd64 linux
gcc:out-of-tree

canceled #1623972
amd64 linux
gcc:sid:amd64

canceled #1623982
amd64 linux
gcc:softhsm2.4

canceled #1623983
amd64 linux
gcc:softhsm2.6

canceled #1623970
amd64 linux
gcc:stretch:amd64

canceled #1623978
amd64 linux
gcc:tsan

canceled #1623974
amd64 linux
gcc:tumbleweed:amd64

canceled #1623987
amd64 windows
msvc:windows:amd64

00:00:06

 
  Unit
canceled #1623997
amd64 linux
unit:clang:asan

canceled #1624001
amd64 linux
unit:clang:buster:amd64

canceled #1624004
amd64 libvirt
unit:clang:freebsd11:amd64

canceled #1624005
amd64 libvirt
unit:clang:freebsd12:amd64

canceled #1624006
amd64 libvirt
unit:clang:openbsd:amd64

canceled #1623999
amd64 linux
unit:clang:tsan

canceled #1623988
amd64 linux
unit:gcc:alpine3.13:amd64

canceled #1623996
amd64 linux
unit:gcc:asan

canceled #1623992
amd64 linux
unit:gcc:buster:amd64

canceled #1623989
amd64 linux
unit:gcc:centos7:amd64

canceled #1623990
amd64 linux
unit:gcc:centos8:amd64

canceled #1623995
amd64 linux
unit:gcc:focal:amd64

canceled #1624000
amd64 linux
unit:gcc:mutexatomics

canceled #1623993
amd64 linux
unit:gcc:sid:amd64

canceled #1624002
amd64 linux
unit:gcc:softhsm2.4

canceled #1624003
amd64 linux
unit:gcc:softhsm2.6

canceled #1623991
amd64 linux
unit:gcc:stretch:amd64

canceled #1623998
amd64 linux
unit:gcc:tsan

canceled #1623994
amd64 linux
unit:gcc:tumbleweed:amd64

 
  System
canceled #1624016
amd64 linux
system:clang:asan

canceled #1624020
amd64 linux
system:clang:buster:amd64

canceled #1624023
amd64 libvirt
system:clang:freebsd11:amd64

canceled #1624024
amd64 libvirt
system:clang:freebsd12:amd64

canceled #1624018
amd64 linux
system:clang:tsan

canceled #1624007
amd64 linux
system:gcc:alpine3.13:amd64

canceled #1624015
amd64 linux
system:gcc:asan

canceled #1624011
amd64 linux
system:gcc:buster:amd64

canceled #1624008
amd64 linux
system:gcc:centos7:amd64

canceled #1624009
amd64 linux
system:gcc:centos8:amd64

canceled #1624014
amd64 linux
system:gcc:focal:amd64

canceled #1624019
amd64 linux
system:gcc:mutexatomics

canceled #1624012
amd64 linux
system:gcc:sid:amd64

canceled #1624021
amd64 linux
system:gcc:softhsm2.4

canceled #1624022
amd64 linux
system:gcc:softhsm2.6

canceled #1624010
amd64 linux
system:gcc:stretch:amd64

canceled #1624017
amd64 linux
system:gcc:tsan

canceled #1624013
amd64 linux
system:gcc:tumbleweed:amd64

 
  Docs
canceled #1624025
amd64 linux
docs

 
  Postcheck
canceled #1624029
amd64 linux
cppcheck

canceled #1624026
amd64 linux
flake8

canceled #1624030
amd64 linux
gcov

canceled #1624027
amd64 linux
pylint

canceled #1624028
amd64 linux
scan-build

 
Name Stage Failure
failed
tarball-create Precheck
make[3]: *** [Makefile:722: distdir-am] Error 1
make[3]: Leaving directory '/builds/isc-projects/bind9/bind-9.17.11/_build/sub'
make[2]: Leaving directory '/builds/isc-projects/bind9/bind-9.17.11/_build/sub'
make[2]: *** [Makefile:716: distdir] Error 2
make[1]: *** [Makefile:820: dist] Error 2
make[1]: Leaving directory '/builds/isc-projects/bind9/bind-9.17.11/_build/sub'
make: *** [Makefile:832: distcheck] Error 1
Cleaning up file based variables
ERROR: Job failed: exit code 1