Wait for named to start

If we don't wait for named to finish starting, 'rndc stop' may
fail due to the listen limit being reached in named leading
to a false negative test
70 jobs for !4921 with marka-shutdown-sync in 61 minutes and 23 seconds (queued for 8 seconds)
latest detached
Status Job ID Name Coverage
  Autoconf
passed #1662605
amd64 linux
autoreconf

00:00:18

 
  Precheck
passed #1662607
amd64 linux
clang-format

00:00:17

passed #1662608
amd64 linux
coccinelle

00:04:10

passed #1662609
amd64 linux
danger

00:00:14

passed #1662606
amd64 linux
misc

00:00:19

passed #1662610
amd64 linux
tarball-create

00:01:38

 
  Build
passed #1662621
amd64 linux
clang:asan

00:01:53

passed #1662625
amd64 linux
clang:buster:amd64

00:00:58

passed #1662628
amd64 libvirt
clang:freebsd11:amd64

00:01:11

passed #1662629
amd64 libvirt
clang:freebsd12:amd64

00:01:17

passed #1662630
amd64 libvirt
clang:openbsd:amd64

00:03:16

passed #1662623
amd64 linux
clang:tsan

00:01:06

passed #1662611
amd64 linux
gcc:alpine3.13:amd64

00:01:04

passed #1662620
amd64 linux
gcc:asan

00:01:49

passed #1662615
amd64 linux
gcc:buster:amd64

00:00:44

passed #1662612
amd64 linux
gcc:centos7:amd64

00:00:50

passed #1662613
amd64 linux
gcc:centos8:amd64

00:01:02

passed #1662619
amd64 linux
gcc:focal:amd64

00:00:52

passed #1662624
amd64 linux
gcc:mutexatomics

00:01:07

passed #1662617
amd64 linux
gcc:out-of-tree

00:01:04

passed #1662616
amd64 linux
gcc:sid:amd64

00:01:14

passed #1662626
amd64 linux
gcc:softhsm2.4

00:00:56

passed #1662627
amd64 linux
gcc:softhsm2.6

00:00:53

passed #1662614
amd64 linux
gcc:stretch:amd64

00:01:00

passed #1662622
amd64 linux
gcc:tsan

00:01:05

passed #1662618
amd64 linux
gcc:tumbleweed:amd64

00:00:55

passed #1662631
amd64 windows
msvc:windows:amd64

00:01:08

 
  Unit
passed #1662641
amd64 linux
unit:clang:asan

00:02:09

passed #1662645
amd64 linux
unit:clang:buster:amd64

00:01:31

passed #1662648
amd64 libvirt
unit:clang:freebsd11:amd64

00:01:57

passed #1662649
amd64 libvirt
unit:clang:freebsd12:amd64

00:01:48

passed #1662650
amd64 libvirt
unit:clang:openbsd:amd64

00:03:26

passed #1662643
amd64 linux
unit:clang:tsan

00:03:37

passed #1662632
amd64 linux
unit:gcc:alpine3.13:amd64

00:01:47

passed #1662640
amd64 linux
unit:gcc:asan

00:02:00

passed #1662636
amd64 linux
unit:gcc:buster:amd64

00:02:47

passed #1662633
amd64 linux
unit:gcc:centos7:amd64

00:01:27

passed #1662634
amd64 linux
unit:gcc:centos8:amd64

00:01:21

passed #1662639
amd64 linux
unit:gcc:focal:amd64

00:01:30

passed #1662644
amd64 linux
unit:gcc:mutexatomics

00:01:34

passed #1662637
amd64 linux
unit:gcc:sid:amd64

00:01:32

passed #1662646
amd64 linux
unit:gcc:softhsm2.4

00:01:25

passed #1662647
amd64 linux
unit:gcc:softhsm2.6

00:01:26

passed #1662635
amd64 linux
unit:gcc:stretch:amd64

00:00:14

passed #1662642
amd64 linux
unit:gcc:tsan

00:04:20

passed #1662638
amd64 linux
unit:gcc:tumbleweed:amd64

00:01:22

 
  System
passed #1662660
amd64 linux
system:clang:asan

00:13:56

failed #1662664
amd64 linux
system:clang:buster:amd64

00:12:20

passed #1662667
amd64 libvirt
system:clang:freebsd11:amd64

00:11:40

passed #1662668
amd64 libvirt
system:clang:freebsd12:amd64

00:11:44

passed #1662662
amd64 linux
system:clang:tsan

00:16:56

passed #1662651
amd64 linux
system:gcc:alpine3.13:amd64

00:12:52

passed #1662659
amd64 linux
system:gcc:asan

00:15:02

passed #1662655
amd64 linux
system:gcc:buster:amd64

00:14:11

passed #1662652
amd64 linux
system:gcc:centos7:amd64

00:12:11

passed #1662653
amd64 linux
system:gcc:centos8:amd64

00:11:37

passed #1662658
amd64 linux
system:gcc:focal:amd64

00:13:25

passed #1662663
amd64 linux
system:gcc:mutexatomics

00:13:04

passed #1662656
amd64 linux
system:gcc:sid:amd64

00:12:37

passed #1662665
amd64 linux
system:gcc:softhsm2.4

00:12:32

passed #1662666
amd64 linux
system:gcc:softhsm2.6

00:11:59

passed #1662654
amd64 linux
system:gcc:stretch:amd64

00:11:59

passed #1662661
amd64 linux
system:gcc:tsan

00:17:16

failed #1662657
amd64 linux
system:gcc:tumbleweed:amd64

01:00:01

 
  Docs
passed #1662669
amd64 linux
docs

00:00:43

 
  Postcheck
passed #1662673
amd64 linux
cppcheck

00:01:00

passed #1662670
amd64 linux
flake8

00:00:20

passed #1662674
amd64 linux
gcov

00:00:34

78.0%
passed #1662671
amd64 linux
pylint

00:00:32

passed #1662672
amd64 linux
scan-build

00:04:33

 
Name Stage Failure
failed
system:gcc:tumbleweed:amd64 System The script exceeded the maximum execution time set for the job
make[3]: *** [Makefile:1216: test-suite.log] Error 1
make[3]: Leaving directory '/builds/isc-projects/bind9/bin/tests/system'
make[2]: *** [Makefile:1324: check-TESTS] Error 2
make[2]: Leaving directory '/builds/isc-projects/bind9/bin/tests/system'
make[1]: *** [Makefile:2168: check-am] Error 2
make[1]: Leaving directory '/builds/isc-projects/bind9/bin/tests/system'
make: *** [Makefile:1105: check-recursive] Error 1
make: Target 'check' not remade because of errors.
ERROR: Job failed: execution took longer than 1h0m0s seconds
failed
system:clang:buster:amd64 System
FAIL pipelined (exit status: 1)

$ test -n "${OUT_OF_TREE_WORKSPACE}" && mv "${OUT_OF_TREE_WORKSPACE}" "${CI_PROJECT_DIR}"
Uploading artifacts for failed job
Uploading artifacts...
untracked: found 1469 files

Uploading artifacts as "archive" to coordinator... ok
id=1662664 responseStatus=201 Created token=mrSqVFUD
Cleaning up file based variables
ERROR: Job failed: exit code 1