fixup! Fixup the GeoIP vs GeoIP2

84 jobs for !985 with 4-convert-to-modern-autotools-autoconf-automake-libtool in 68 minutes (queued for 7 seconds)
detached
Status Job ID Name Coverage
  Precheck
passed #293638
amd64 linux
🐞:sid:amd64

00:01:29

passed #293636
amd64 linux
autoreconf:sid:amd64

00:00:36

passed #293637
amd64 linux
misc:sid:amd64

00:00:17

 
  Build
passed #293651
amd64 linux
asan:sid:amd64

00:02:01

passed #293654
amd64 linux
clang:stretch:amd64

00:02:01

passed #293655
i386 linux
clang:stretch:i386

00:01:29

failed #293639
amd64 linux allowed to fail
docs:sid:amd64

00:00:38

passed #293712
amd64 linux
gcc:alpine3.10:amd64

00:01:25

passed #293650
amd64 linux
gcc:bionic:amd64

00:01:41

passed #293645
i386 linux
gcc:buster:amd64

00:01:47

passed #293641
amd64 linux
gcc:centos6:amd64

00:01:45

passed #293642
amd64 linux
gcc:centos7:amd64

00:01:14

passed #293648
amd64 linux
gcc:fedora30:amd64

00:01:46

passed #293643
amd64 linux
gcc:jessie:amd64

00:01:55

passed #293646
amd64 linux
gcc:sid:amd64

00:01:45

passed #293647
i386 linux
gcc:sid:i386

00:01:56

passed #293644
amd64 linux
gcc:stretch:amd64

00:01:58

passed #293649
amd64 linux
gcc:xenial:amd64

00:01:54

passed #293653
amd64 linux
mutexatomics:sid:amd64

00:02:05

passed #293657
amd64 linux
nolibtool:sid:amd64

00:01:52

passed #293656
amd64 linux
pkcs11:sid:amd64

00:01:43

passed #293652
amd64 linux
rwlock:sid:amd64

00:01:48

failed #293640
amd64 linux
gcc:alpine3.10:amd64

00:01:19

 
  Test
failed #293744
amd64 linux
system:asan:sid:amd64

00:08:10

failed #293743
amd64 linux
system:gcc:alpine3.10:amd64

00:06:41

failed #293737
amd64 linux
system:gcc:bionic:amd64

00:06:23

failed #293730
i386 linux
system:gcc:buster:amd64

00:07:12

failed #293736
amd64 linux
system:gcc:centos6:amd64

00:07:41

failed #293735
amd64 linux
system:gcc:centos7:amd64

00:07:32

failed #293740
amd64 linux
system:gcc:fedora30:amd64

00:07:51

failed #293738
amd64 linux
system:gcc:jessie:amd64

00:07:32

failed #293733
amd64 linux
system:gcc:sid:amd64

00:06:46

failed #293734
i386 linux
system:gcc:sid:i386

00:06:48

failed #293741
amd64 linux
system:gcc:stretch:amd64

00:07:35

failed #293731
amd64 linux
system:gcc:xenial:amd64

01:00:08

failed #293739
amd64 linux
system:nolibtool:sid:amd64

00:07:46

failed #293732
amd64 linux
system:pkcs11:sid:amd64

00:06:21

failed #293742
amd64 linux
system:rwlock:sid:amd64

00:07:43

failed #293681
amd64 linux
unit:asan:sid:amd64

00:02:42

failed #293684
amd64 linux
unit:clang:stretch:amd64

00:02:42

failed #293659
amd64 linux
unit:gcc:alpine3.10:amd64

00:02:30

failed #293679
amd64 linux
unit:gcc:bionic:amd64

00:02:40

failed #293669
i386 linux
unit:gcc:buster:amd64

00:02:35

passed #293661
amd64 linux
unit:gcc:centos6:amd64

00:02:30

failed #293663
amd64 linux
unit:gcc:centos7:amd64

00:02:32

failed #293675
amd64 linux
unit:gcc:fedora30:amd64

00:02:38

passed #293665
amd64 linux
unit:gcc:jessie:amd64

00:00:29

failed #293671
amd64 linux
unit:gcc:sid:amd64

00:02:36

failed #293673
i386 linux
unit:gcc:sid:i386

00:02:37

failed #293667
amd64 linux
unit:gcc:stretch:amd64

00:02:33

failed #293677
amd64 linux
unit:gcc:xenial:amd64

00:02:38

failed #293688
amd64 linux
unit:nolibtool:sid:amd64

00:02:39

failed #293686
amd64 linux
unit:pkcs11:sid:amd64

00:02:40

failed #293683
amd64 linux
unit:rwlock:sid:amd64

00:02:42

failed #293680
amd64 linux
system:asan:sid:amd64

00:08:24

failed #293726
amd64 linux
system:asan:sid:amd64

00:09:08

failed #293658
amd64 linux
system:gcc:alpine3.10:amd64

00:09:14

failed #293728
amd64 linux
system:gcc:alpine3.10:amd64

00:06:43

failed #293713
amd64 linux
system:gcc:bionic:amd64

00:07:47

failed #293678
amd64 linux
system:gcc:bionic:amd64

00:06:41

failed #293717
i386 linux
system:gcc:buster:amd64

00:06:28

failed #293668
i386 linux
system:gcc:buster:amd64

00:06:52

failed #293715
amd64 linux
system:gcc:centos6:amd64

00:07:32

failed #293660
amd64 linux
system:gcc:centos6:amd64

00:06:38

failed #293714
amd64 linux
system:gcc:centos7:amd64

00:07:29

failed #293662
amd64 linux
system:gcc:centos7:amd64

00:06:33

failed #293719
amd64 linux
system:gcc:fedora30:amd64

00:08:00

failed #293674
amd64 linux
system:gcc:fedora30:amd64

00:07:04

failed #293720
amd64 linux
system:gcc:jessie:amd64

00:07:26

failed #293664
amd64 linux
system:gcc:jessie:amd64

00:07:06

failed #293670
amd64 linux
system:gcc:sid:amd64

00:07:17

failed #293724
amd64 linux
system:gcc:sid:amd64

00:06:43

failed #293723
i386 linux
system:gcc:sid:i386

00:06:47

failed #293672
i386 linux
system:gcc:sid:i386

00:07:16

failed #293666
amd64 linux
system:gcc:stretch:amd64

00:06:50

failed #293716
amd64 linux
system:gcc:stretch:amd64

00:08:17

failed #293721
amd64 linux
system:gcc:xenial:amd64

00:06:19

failed #293676
amd64 linux
system:gcc:xenial:amd64

00:07:12

failed #293687
amd64 linux
system:nolibtool:sid:amd64

00:07:01

failed #293718
amd64 linux
system:nolibtool:sid:amd64

00:07:56

failed #293685
amd64 linux
system:pkcs11:sid:amd64

00:07:17

failed #293722
amd64 linux
system:pkcs11:sid:amd64

00:06:32

failed #293682
amd64 linux
system:rwlock:sid:amd64

00:07:54

failed #293725
amd64 linux
system:rwlock:sid:amd64

00:07:52

 
Name Stage Failure
failed
system:gcc:xenial:amd64 Test The script exceeded the maximum execution time set for the job
PASS: rpz
PASS: views
PASS: zonechecks
PASS: zero
PASS: upforwd
PASS: xferquota
PASS: xfer
Pulling docker image gitlab/gitlab-runner-helper:x86_64-de7731dd ...
ERROR: Job failed: execution took longer than 1h0m0s seconds
failed
system:asan:sid:amd64 Test
make[2]: Leaving directory '/builds/isc-projects/bind9/bin/tests'
make[1]: Leaving directory '/builds/isc-projects/bind9/bin/tests'
make: *** [Makefile:588: check-recursive] Error 1
make: Target 'check' not remade because of errors.
cat: bin/tests/system/test-suite.log: No such file or directory
Uploading artifacts...
untracked: found 1495 files
Uploading artifacts to coordinator... ok
id=293744 responseStatus=201 Created token=yp1u4zJn
ERROR: Job failed: exit code 1
failed
system:rwlock:sid:amd64 Test
make[2]: Leaving directory '/builds/isc-projects/bind9/bin/tests'
make[1]: Leaving directory '/builds/isc-projects/bind9/bin/tests'
make: *** [Makefile:588: check-recursive] Error 1
make: Target 'check' not remade because of errors.
cat: bin/tests/system/test-suite.log: No such file or directory
Uploading artifacts...
untracked: found 1434 files
Uploading artifacts to coordinator... ok
id=293742 responseStatus=201 Created token=xb2Pib_C
ERROR: Job failed: exit code 1
failed
system:gcc:fedora30:amd64 Test
make[2]: Leaving directory '/builds/isc-projects/bind9/bin/tests'
make[1]: Leaving directory '/builds/isc-projects/bind9/bin/tests'
make: *** [Makefile:588: check-recursive] Error 1
make: Target 'check' not remade because of errors.
cat: bin/tests/system/test-suite.log: No such file or directory
Uploading artifacts...
untracked: found 1475 files
Uploading artifacts to coordinator... ok
id=293740 responseStatus=201 Created token=NMtm5ax7
ERROR: Job failed: exit code 1
failed
system:gcc:alpine3.10:amd64 Test
make[2]: Leaving directory '/builds/isc-projects/bind9/bin/tests'
make[1]: Leaving directory '/builds/isc-projects/bind9/bin/tests'
make: *** [Makefile:588: check-recursive] Error 1
make: Target 'check' not remade because of errors.
cat: can't open 'bin/tests/system/test-suite.log': No such file or directory
Uploading artifacts...
untracked: found 1472 files
Uploading artifacts to coordinator... ok
id=293743 responseStatus=201 Created token=FKk5c_7T
ERROR: Job failed: exit code 1
failed
system:gcc:stretch:amd64 Test
make[1]: Leaving directory '/builds/isc-projects/bind9/bin/tests'
Makefile:588: recipe for target 'check-recursive' failed
make: *** [check-recursive] Error 1
make: Target 'check' not remade because of errors.
cat: bin/tests/system/test-suite.log: No such file or directory
Uploading artifacts...
untracked: found 1451 files
Uploading artifacts to coordinator... ok
id=293741 responseStatus=201 Created token=whjftbZ8
ERROR: Job failed: exit code 1
failed
system:nolibtool:sid:amd64 Test
make[2]: Leaving directory '/builds/isc-projects/bind9/bin/tests'
make[1]: Leaving directory '/builds/isc-projects/bind9/bin/tests'
make: *** [Makefile:588: check-recursive] Error 1
make: Target 'check' not remade because of errors.
cat: bin/tests/system/test-suite.log: No such file or directory
Uploading artifacts...
untracked: found 1468 files
Uploading artifacts to coordinator... ok
id=293739 responseStatus=201 Created token=jU5MvpD3
ERROR: Job failed: exit code 1
failed
system:gcc:jessie:amd64 Test
make[1]: Leaving directory '/builds/isc-projects/bind9/bin/tests'
make: *** [check-recursive] Error 1
make: Target 'check' not remade because of errors.
Makefile:588: recipe for target 'check-recursive' failed
cat: bin/tests/system/test-suite.log: No such file or directory
Uploading artifacts...
untracked: found 1526 files
Uploading artifacts to coordinator... ok
id=293738 responseStatus=201 Created token=VhiCq-_M
ERROR: Job failed: exit code 1
failed
system:gcc:centos6:amd64 Test
make[2]: Leaving directory `/builds/isc-projects/bind9/bin/tests'
make[1]: Leaving directory `/builds/isc-projects/bind9/bin/tests'
make: *** [check-recursive] Error 1
make: Target `check' not remade because of errors.
cat: bin/tests/system/test-suite.log: No such file or directory
Uploading artifacts...
untracked: found 1656 files
Uploading artifacts to coordinator... ok
id=293736 responseStatus=201 Created token=7ZMFRx_u
ERROR: Job failed: exit code 1
failed
system:gcc:centos7:amd64 Test
make[2]: Leaving directory `/builds/isc-projects/bind9/bin/tests'
make[1]: Leaving directory `/builds/isc-projects/bind9/bin/tests'
make: *** [check-recursive] Error 1
make: Target `check' not remade because of errors.
cat: bin/tests/system/test-suite.log: No such file or directory
Uploading artifacts...
untracked: found 1493 files
Uploading artifacts to coordinator... ok
id=293735 responseStatus=201 Created token=APCXSxDs
ERROR: Job failed: exit code 1
failed
system:gcc:sid:i386 Test
make[1]: Leaving directory '/builds/isc-projects/bind9/bin/tests'
make: *** [Makefile:588: check-recursive] Error 1
make: Target 'check' not remade because of errors.
cat: bin/tests/system/test-suite.log: No such file or directory
Authenticating with credentials from /root/.docker/config.json
Uploading artifacts...
untracked: found 1939 files

Uploading artifacts to coordinator... ok
id=293734 responseStatus=201 Created token=_UwAxrAq
ERROR: Job failed: exit code 1
failed
system:gcc:sid:amd64 Test
make[1]: Leaving directory '/builds/isc-projects/bind9/bin/tests'
make: *** [Makefile:588: check-recursive] Error 1
make: Target 'check' not remade because of errors.
cat: bin/tests/system/test-suite.log: No such file or directory
Authenticating with credentials from /root/.docker/config.json
Uploading artifacts...
untracked: found 1693 files

Uploading artifacts to coordinator... ok
id=293733 responseStatus=201 Created token=U6Adyjsr
ERROR: Job failed: exit code 1
failed
system:gcc:bionic:amd64 Test
make[1]: Leaving directory '/builds/isc-projects/bind9/bin/tests'
Makefile:588: recipe for target 'check-recursive' failed
make: *** [check-recursive] Error 1
make: Target 'check' not remade because of errors.
cat: bin/tests/system/test-suite.log: No such file or directory
Uploading artifacts...
untracked: found 1434 files
Uploading artifacts to coordinator... ok
id=293737 responseStatus=201 Created token=YkPa8bsL
ERROR: Job failed: exit code 1
failed
system:gcc:buster:amd64 Test
make[2]: Leaving directory '/builds/isc-projects/bind9/bin/tests'
make[1]: Leaving directory '/builds/isc-projects/bind9/bin/tests'
make: *** [Makefile:588: check-recursive] Error 1
make: Target 'check' not remade because of errors.
cat: bin/tests/system/test-suite.log: No such file or directory
Uploading artifacts...
untracked: found 1520 files
Uploading artifacts to coordinator... ok
id=293730 responseStatus=201 Created token=zoyXzysh
ERROR: Job failed: exit code 1
failed
system:pkcs11:sid:amd64 Test
make[2]: Leaving directory '/builds/isc-projects/bind9/bin/tests'
make[1]: Leaving directory '/builds/isc-projects/bind9/bin/tests'
make: *** [Makefile:588: check-recursive] Error 1
make: Target 'check' not remade because of errors.
cat: bin/tests/system/test-suite.log: No such file or directory
Uploading artifacts...
untracked: found 1714 files
Uploading artifacts to coordinator... ok
id=293732 responseStatus=201 Created token=CfpSTP-X
ERROR: Job failed: exit code 1
failed
unit:gcc:sid:i386 Test
make[3]: Leaving directory '/builds/isc-projects/bind9/lib/irs/tests'
make[2]: Leaving directory '/builds/isc-projects/bind9/lib/irs/tests'
make[1]: *** [Makefile:4003: check-recursive] Error 1
make[1]: Leaving directory '/builds/isc-projects/bind9/lib'
make: *** [Makefile:4155: check] Error 2
Uploading artifacts...
lib/*/tests/*.log: found 41 matching files
Uploading artifacts to coordinator... ok
id=293673 responseStatus=201 Created token=MFyqFfgp
ERROR: Job failed: exit code 1
failed
unit:gcc:centos7:amd64 Test
make[3]: Leaving directory `/builds/isc-projects/bind9/lib/irs/tests'
make[2]: Leaving directory `/builds/isc-projects/bind9/lib/irs/tests'
make[1]: *** [check-recursive] Error 1
make[1]: Leaving directory `/builds/isc-projects/bind9/lib'
make: *** [check] Error 2
Uploading artifacts...
lib/*/tests/*.log: found 41 matching files
Uploading artifacts to coordinator... ok
id=293663 responseStatus=201 Created token=VKximmn2
ERROR: Job failed: exit code 1
failed
unit:asan:sid:amd64 Test
make[3]: Leaving directory '/builds/isc-projects/bind9/lib/irs/tests'
make[2]: Leaving directory '/builds/isc-projects/bind9/lib/irs/tests'
make[1]: *** [Makefile:4003: check-recursive] Error 1
make[1]: Leaving directory '/builds/isc-projects/bind9/lib'
make: *** [Makefile:4155: check] Error 2
Uploading artifacts...
lib/*/tests/*.log: found 41 matching files
Uploading artifacts to coordinator... ok
id=293681 responseStatus=201 Created token=-6_UYAjU
ERROR: Job failed: exit code 1
failed
unit:gcc:sid:amd64 Test
make[3]: Leaving directory '/builds/isc-projects/bind9/lib/irs/tests'
make[2]: Leaving directory '/builds/isc-projects/bind9/lib/irs/tests'
make[1]: *** [Makefile:4003: check-recursive] Error 1
make[1]: Leaving directory '/builds/isc-projects/bind9/lib'
make: *** [Makefile:4155: check] Error 2
Uploading artifacts...
lib/*/tests/*.log: found 41 matching files
Uploading artifacts to coordinator... ok
id=293671 responseStatus=201 Created token=4G8LjKJx
ERROR: Job failed: exit code 1
failed
unit:gcc:alpine3.10:amd64 Test
make[3]: Leaving directory '/builds/isc-projects/bind9/lib/irs/tests'
make[2]: Leaving directory '/builds/isc-projects/bind9/lib/irs/tests'
make[1]: *** [Makefile:4003: check-recursive] Error 1
make[1]: Leaving directory '/builds/isc-projects/bind9/lib'
make: *** [Makefile:4155: check] Error 2
Uploading artifacts...
lib/*/tests/*.log: found 41 matching files
Uploading artifacts to coordinator... ok
id=293659 responseStatus=201 Created token=y7yHbxFW
ERROR: Job failed: exit code 1
failed
unit:clang:stretch:amd64 Test
Makefile:4003: recipe for target 'check-recursive' failed
make[1]: *** [check-recursive] Error 1
make[1]: Leaving directory '/builds/isc-projects/bind9/lib'
Makefile:4155: recipe for target 'check' failed
make: *** [check] Error 2
Uploading artifacts...
lib/*/tests/*.log: found 41 matching files
Uploading artifacts to coordinator... ok
id=293684 responseStatus=201 Created token=aFVF2fjQ
ERROR: Job failed: exit code 1
failed
unit:gcc:xenial:amd64 Test
Makefile:4003: recipe for target 'check-recursive' failed
make[1]: *** [check-recursive] Error 1
make[1]: Leaving directory '/builds/isc-projects/bind9/lib'
Makefile:4155: recipe for target 'check' failed
make: *** [check] Error 2
Uploading artifacts...
lib/*/tests/*.log: found 73 matching files
Uploading artifacts to coordinator... ok
id=293677 responseStatus=201 Created token=m9jqQjzq
ERROR: Job failed: exit code 1
failed
unit:gcc:bionic:amd64 Test
Makefile:4003: recipe for target 'check-recursive' failed
make[1]: *** [check-recursive] Error 1
make[1]: Leaving directory '/builds/isc-projects/bind9/lib'
Makefile:4155: recipe for target 'check' failed
make: *** [check] Error 2
Uploading artifacts...
lib/*/tests/*.log: found 41 matching files
Uploading artifacts to coordinator... ok
id=293679 responseStatus=201 Created token=txbj_7By
ERROR: Job failed: exit code 1
failed
unit:gcc:buster:amd64 Test
make[3]: Leaving directory '/builds/isc-projects/bind9/lib/irs/tests'
make[2]: Leaving directory '/builds/isc-projects/bind9/lib/irs/tests'
make[1]: *** [Makefile:4003: check-recursive] Error 1
make[1]: Leaving directory '/builds/isc-projects/bind9/lib'
make: *** [Makefile:4155: check] Error 2
Uploading artifacts...
lib/*/tests/*.log: found 41 matching files
Uploading artifacts to coordinator... ok
id=293669 responseStatus=201 Created token=RgzsAtDS
ERROR: Job failed: exit code 1
failed
unit:gcc:fedora30:amd64 Test
make[3]: Leaving directory '/builds/isc-projects/bind9/lib/irs/tests'
make[2]: Leaving directory '/builds/isc-projects/bind9/lib/irs/tests'
make[1]: *** [Makefile:4003: check-recursive] Error 1
make[1]: Leaving directory '/builds/isc-projects/bind9/lib'
make: *** [Makefile:4155: check] Error 2
Uploading artifacts...
lib/*/tests/*.log: found 41 matching files
Uploading artifacts to coordinator... ok
id=293675 responseStatus=201 Created token=cactRTJb
ERROR: Job failed: exit code 1
failed
unit:rwlock:sid:amd64 Test
make[3]: Leaving directory '/builds/isc-projects/bind9/lib/irs/tests'
make[2]: Leaving directory '/builds/isc-projects/bind9/lib/irs/tests'
make[1]: *** [Makefile:4003: check-recursive] Error 1
make[1]: Leaving directory '/builds/isc-projects/bind9/lib'
make: *** [Makefile:4155: check] Error 2
Uploading artifacts...
lib/*/tests/*.log: found 41 matching files
Uploading artifacts to coordinator... ok
id=293683 responseStatus=201 Created token=KjUa9odU
ERROR: Job failed: exit code 1
failed
unit:pkcs11:sid:amd64 Test
make[3]: Leaving directory '/builds/isc-projects/bind9/lib/irs/tests'
make[2]: Leaving directory '/builds/isc-projects/bind9/lib/irs/tests'
make[1]: *** [Makefile:4003: check-recursive] Error 1
make[1]: Leaving directory '/builds/isc-projects/bind9/lib'
make: *** [Makefile:4155: check] Error 2
Uploading artifacts...
lib/*/tests/*.log: found 41 matching files
Uploading artifacts to coordinator... ok
id=293686 responseStatus=201 Created token=TsQfSxMN
ERROR: Job failed: exit code 1
failed
unit:gcc:stretch:amd64 Test
make[1]: *** [check-recursive] Error 1
Makefile:4003: recipe for target 'check-recursive' failed
make[1]: Leaving directory '/builds/isc-projects/bind9/lib'
make: *** [check] Error 2
Makefile:4155: recipe for target 'check' failed
Uploading artifacts...
lib/*/tests/*.log: found 41 matching files
Uploading artifacts to coordinator... ok
id=293667 responseStatus=201 Created token=Hymx3BJL
ERROR: Job failed: exit code 1
failed
unit:nolibtool:sid:amd64 Test
make[2]: Leaving directory '/builds/isc-projects/bind9/lib/irs/tests'
make[1]: *** [Makefile:4003: check-recursive] Error 1
make[1]: Leaving directory '/builds/isc-projects/bind9/lib'
make: *** [Makefile:4155: check] Error 2
Authenticating with credentials from /root/.docker/config.json
Uploading artifacts...
lib/*/tests/*.log: found 41 matching files

Uploading artifacts to coordinator... ok
id=293688 responseStatus=201 Created token=7s2isVmM
ERROR: Job failed: exit code 1
failed
docs:sid:amd64 Build
    
-------------------------------------------------------------------------------
For more detail, use --enable-full-report.
===============================================================================
$ make -C doc/misc docbook
make: Entering directory '/builds/isc-projects/bind9/doc/misc'
make: *** No rule to make target 'docbook'. Stop.
make: Leaving directory '/builds/isc-projects/bind9/doc/misc'
ERROR: Job failed: exit code 1