Added system test for named-compilezone

Added a system test which ensures that named-compilezone works when
taking input data from stdin.
Status Job ID Name Coverage
  Precheck
passed #406772
amd64 linux
🐞:sid:amd64

00:01:48

passed #406770
amd64 linux
autoreconf:sid:amd64

00:00:35

failed #406771
amd64 linux
misc:sid:amd64

00:00:36

 
  Build
passed #406785
amd64 linux
asan:sid:amd64

00:01:53

passed #406791
amd64 freebsd
clang:freebsd11.3:amd64

00:01:18

passed #406792
amd64 freebsd
clang:freebsd12.0:amd64

00:01:08

passed #406793
amd64 openbsd
clang:openbsd6.5:amd64

00:05:08

passed #406788
amd64 linux
clang:stretch:amd64

00:03:29

passed #406789
i386 linux
clang:stretch:i386

00:01:30

passed #406773
amd64 linux
gcc:alpine3.10:amd64

00:03:05

passed #406784
amd64 linux
gcc:bionic:amd64

00:01:42

passed #406779
amd64 linux
gcc:buster:amd64

00:01:40

passed #406774
amd64 linux
gcc:centos6:amd64

00:02:23

passed #406775
amd64 linux
gcc:centos7:amd64

00:02:34

passed #406776
amd64 linux
gcc:centos8:amd64

00:02:43

passed #406782
amd64 linux
gcc:fedora30:amd64

00:02:21

passed #406777
amd64 linux
gcc:jessie:amd64

00:01:35

passed #406780
amd64 linux
gcc:sid:amd64

00:02:36

passed #406781
i386 linux
gcc:sid:i386

00:01:42

passed #406778
amd64 linux
gcc:stretch:amd64

00:01:42

passed #406783
amd64 linux
gcc:xenial:amd64

00:02:53

passed #406795
amd64 windows
msvc:windows:amd64

00:03:22

passed #406787
amd64 linux
mutexatomics:sid:amd64

00:01:25

passed #406794
amd64 linux
nolibtool:sid:amd64

00:02:50

passed #406790
amd64 linux
pkcs11:sid:amd64

00:01:25

passed #406786
amd64 linux
rwlock:sid:amd64

00:01:28

 
  Unit
passed #406808
amd64 linux
unit:asan:sid:amd64

00:04:33

passed #406812
amd64 freebsd
unit:clang:freebsd11.3:amd64

00:00:28

passed #406813
amd64 freebsd
unit:clang:freebsd12.0:amd64

00:01:04

passed #406810
amd64 linux
unit:clang:stretch:amd64

00:01:04

passed #406796
amd64 linux
unit:gcc:alpine3.10:amd64

00:03:19

passed #406807
amd64 linux
unit:gcc:bionic:amd64

00:00:51

passed #406802
amd64 linux
unit:gcc:buster:amd64

00:01:26

passed #406797
amd64 linux
unit:gcc:centos6:amd64

00:00:48

passed #406798
amd64 linux
unit:gcc:centos7:amd64

00:00:52

passed #406799
amd64 linux
unit:gcc:centos8:amd64

00:00:47

passed #406805
amd64 linux
unit:gcc:fedora30:amd64

00:01:56

passed #406800
amd64 linux
unit:gcc:jessie:amd64

00:00:29

passed #406803
amd64 linux
unit:gcc:sid:amd64

00:01:42

passed #406804
i386 linux
unit:gcc:sid:i386

00:01:49

passed #406801
amd64 linux
unit:gcc:stretch:amd64

00:00:53

passed #406806
amd64 linux
unit:gcc:xenial:amd64

00:01:25

passed #406814
amd64 linux
unit:nolibtool:sid:amd64

00:01:39

passed #406811
amd64 linux
unit:pkcs11:sid:amd64

00:01:17

passed #406809
amd64 linux
unit:rwlock:sid:amd64

00:01:18

 
  System
passed #406827
amd64 linux
system:asan:sid:amd64

00:10:01

passed #406830
amd64 freebsd
system:clang:freebsd11.3:amd64

00:08:22

failed #406844
amd64 freebsd
system:clang:freebsd12.0:amd64

00:08:11

passed #406815
amd64 linux
system:gcc:alpine3.10:amd64

00:08:36

failed #406846
amd64 linux
system:gcc:bionic:amd64

00:07:06

failed #406845
amd64 linux
system:gcc:buster:amd64

00:07:24

passed #406816
amd64 linux
system:gcc:centos6:amd64

00:07:36

passed #406817
amd64 linux
system:gcc:centos7:amd64

00:07:33

passed #406840
linux amd64
system:gcc:centos8:amd64

00:07:47

passed #406824
amd64 linux
system:gcc:fedora30:amd64

00:08:35

passed #406819
amd64 linux
system:gcc:jessie:amd64

00:08:18

passed #406822
amd64 linux
system:gcc:sid:amd64

00:08:12

failed #406847
i386 linux
system:gcc:sid:i386

00:07:59

passed #406836
linux amd64
system:gcc:stretch:amd64

00:06:42

passed #406825
amd64 linux
system:gcc:xenial:amd64

00:07:10

passed #406848
amd64 linux
system:nolibtool:sid:amd64

00:08:24

passed #406829
amd64 linux
system:pkcs11:sid:amd64

00:09:06

passed #406828
amd64 linux
system:rwlock:sid:amd64

00:08:34

failed #406837
freebsd amd64
system:clang:freebsd12.0:amd64

00:08:08

failed #406831
amd64 freebsd
system:clang:freebsd12.0:amd64

00:08:33

failed #406841
linux amd64
system:gcc:bionic:amd64

00:07:32

failed #406826
amd64 linux
system:gcc:bionic:amd64

00:09:23

failed #406821
amd64 linux
system:gcc:buster:amd64

00:08:55

failed #406838
linux amd64
system:gcc:buster:amd64

00:07:37

failed #406818
amd64 linux
system:gcc:centos8:amd64

00:08:22

failed #406839
linux i386
system:gcc:sid:i386

00:08:21

failed #406823
i386 linux
system:gcc:sid:i386

00:09:02

failed #406820
amd64 linux
system:gcc:stretch:amd64

00:07:46

failed #406832
amd64 linux
system:nolibtool:sid:amd64

00:10:03

failed #406842
linux amd64
system:nolibtool:sid:amd64

00:09:38

 
  Docs
passed #406833
amd64 linux
docs:sid:amd64

00:01:03

 
  Postcheck
passed #406835
amd64 linux
cppcheck:gcc:sid:amd64

00:01:41

passed #406834
amd64 linux
scan-build:buster:amd64

00:12:00

 
Name Stage Failure
failed
system:gcc:sid:i386 System
I:      3 UNTESTED
I:The following system tests failed:
I: kasp
make: *** [Makefile:486: test] Error 1
Authenticating with credentials from /root/.docker/config.json
Uploading artifacts...
untracked: found 2513 files

Uploading artifacts to coordinator... ok
id=406847 responseStatus=201 Created token=Z_jfzGCq
ERROR: Job failed: exit code 1
failed
system:clang:freebsd12.0:amd64 System
I:      resolver
*** [test] Error code 1

make: stopped in /builds/isc-projects/bind9/bin/tests/system
Uploading artifacts...
Runtime platform arch=amd64 os=freebsd pid=34753 revision=de7731dd version=12.1.0
untracked: found 1467 files

Uploading artifacts to coordinator... ok
id=406844 responseStatus=201 Created token=_P1E9xnw
ERROR: Job failed: exit status 1
failed
system:gcc:bionic:amd64 System
I:     95 PASS
I:The following system tests failed:
I: mkeys
Makefile:484: recipe for target 'test' failed
make: *** [test] Error 1
Uploading artifacts...
untracked: found 1420 files
Uploading artifacts to coordinator... ok
id=406846 responseStatus=201 Created token=SiFkoERy
ERROR: Job failed: exit code 1
failed
system:gcc:buster:amd64 System
I:      1 FAIL
I: 95 PASS
I:The following system tests failed:
I: fetchlimit
make: *** [Makefile:486: test] Error 1
Uploading artifacts...
untracked: found 1338 files
Uploading artifacts to coordinator... ok
id=406845 responseStatus=201 Created token=Db39vWTT
ERROR: Job failed: exit code 1
failed
misc:sid:amd64 Precheck
$ diff -urNap util/copyrights util/newcopyrights
$ rm util/newcopyrights
$ perl -w util/update_copyrights < util/copyrights
./bin/tests/system/compilezone/zones/zone1.raw: type '?' not supported yet; skipping
Uploading artifacts...
WARNING: util/newcopyrights: no matching files
checklibs.out: found 1 matching files

Uploading artifacts to coordinator... ok
id=406771 responseStatus=201 Created token=vEa8cSna
ERROR: Job failed: exit code 1