In developer mode assert if statistics counter underflows

102 jobs for !2453 with 1087-rrset-strict-stats in 73 minutes and 9 seconds (queued for 6 seconds)
detached
Status Job ID Name Coverage
  Precheck
passed #412813
amd64 linux
🐞:sid:amd64

00:01:55

passed #412811
amd64 linux
autoreconf:sid:amd64

00:00:37

passed #412812
amd64 linux
misc:sid:amd64

00:00:19

 
  Build
passed #412826
amd64 linux
asan:sid:amd64

00:01:49

passed #412832
amd64 freebsd
clang:freebsd11.3:amd64

00:01:18

passed #412833
amd64 freebsd
clang:freebsd12.0:amd64

00:01:07

passed #412834
amd64 openbsd
clang:openbsd6.5:amd64

00:05:38

passed #412829
amd64 linux
clang:stretch:amd64

00:01:42

passed #412830
i386 linux
clang:stretch:i386

00:01:36

passed #412814
amd64 linux
gcc:alpine3.10:amd64

00:02:50

passed #412825
amd64 linux
gcc:bionic:amd64

00:01:25

passed #412820
amd64 linux
gcc:buster:amd64

00:01:26

passed #412815
amd64 linux
gcc:centos6:amd64

00:02:40

passed #412816
amd64 linux
gcc:centos7:amd64

00:02:12

passed #412817
amd64 linux
gcc:centos8:amd64

00:03:09

passed #412823
amd64 linux
gcc:fedora30:amd64

00:02:38

passed #412818
amd64 linux
gcc:jessie:amd64

00:01:27

passed #412821
amd64 linux
gcc:sid:amd64

00:03:15

passed #412822
i386 linux
gcc:sid:i386

00:01:40

passed #412819
amd64 linux
gcc:stretch:amd64

00:01:33

passed #412824
amd64 linux
gcc:xenial:amd64

00:01:32

passed #412836
amd64 windows
msvc:windows:amd64

00:02:55

passed #412828
amd64 linux
mutexatomics:sid:amd64

00:01:38

passed #412835
amd64 linux
nolibtool:sid:amd64

00:02:13

passed #412831
amd64 linux
pkcs11:sid:amd64

00:02:47

passed #412827
amd64 linux
rwlock:sid:amd64

00:01:34

 
  Unit
passed #412849
amd64 linux
unit:asan:sid:amd64

00:04:44

passed #412853
amd64 freebsd
unit:clang:freebsd11.3:amd64

00:00:31

passed #412854
amd64 freebsd
unit:clang:freebsd12.0:amd64

00:01:13

passed #412851
amd64 linux
unit:clang:stretch:amd64

00:00:52

passed #412837
amd64 linux
unit:gcc:alpine3.10:amd64

00:02:40

passed #412848
amd64 linux
unit:gcc:bionic:amd64

00:00:53

passed #412843
amd64 linux
unit:gcc:buster:amd64

00:01:17

passed #412838
amd64 linux
unit:gcc:centos6:amd64

00:00:56

passed #412839
amd64 linux
unit:gcc:centos7:amd64

00:00:58

passed #412840
amd64 linux
unit:gcc:centos8:amd64

00:00:52

passed #412846
amd64 linux
unit:gcc:fedora30:amd64

00:01:28

passed #412841
amd64 linux
unit:gcc:jessie:amd64

00:00:29

passed #412844
amd64 linux
unit:gcc:sid:amd64

00:01:23

passed #412845
i386 linux
unit:gcc:sid:i386

00:01:58

passed #412842
amd64 linux
unit:gcc:stretch:amd64

00:00:53

passed #412847
amd64 linux
unit:gcc:xenial:amd64

00:00:56

passed #412855
amd64 linux
unit:nolibtool:sid:amd64

00:01:37

passed #412852
amd64 linux
unit:pkcs11:sid:amd64

00:01:22

passed #412850
amd64 linux
unit:rwlock:sid:amd64

00:01:22

 
  System
failed #412913
amd64 linux
system:asan:sid:amd64

00:13:11

failed #412902
amd64 freebsd
system:clang:freebsd11.3:amd64

00:11:50

failed #412900
amd64 freebsd
system:clang:freebsd12.0:amd64

00:11:51

failed #412910
amd64 linux
system:gcc:alpine3.10:amd64

00:12:30

failed #412899
amd64 linux
system:gcc:bionic:amd64

00:11:16

failed #412901
amd64 linux
system:gcc:buster:amd64

01:00:00

failed #412905
amd64 linux
system:gcc:centos6:amd64

00:11:15

failed #412903
amd64 linux
system:gcc:centos7:amd64

00:11:22

failed #412906
amd64 linux
system:gcc:centos8:amd64

00:11:13

failed #412908
amd64 linux
system:gcc:fedora30:amd64

00:11:47

failed #412898
amd64 linux
system:gcc:jessie:amd64

00:11:12

failed #412909
amd64 linux
system:gcc:sid:amd64

00:11:43

failed #412907
i386 linux
system:gcc:sid:i386

00:12:26

failed #412897
amd64 linux
system:gcc:stretch:amd64

00:10:53

failed #412896
amd64 linux
system:gcc:xenial:amd64

00:10:45

failed #412912
amd64 linux
system:nolibtool:sid:amd64

00:13:07

failed #412911
amd64 linux
system:pkcs11:sid:amd64

00:12:03

failed #412904
amd64 linux
system:rwlock:sid:amd64

00:11:53

failed #412895
linux amd64
system:asan:sid:amd64

00:13:15

failed #412868
amd64 linux
system:asan:sid:amd64

00:13:55

failed #412871
amd64 freebsd
system:clang:freebsd11.3:amd64

00:12:02

failed #412882
freebsd amd64
system:clang:freebsd11.3:amd64

00:11:54

failed #412872
amd64 freebsd
system:clang:freebsd12.0:amd64

00:12:05

failed #412879
freebsd amd64
system:clang:freebsd12.0:amd64

00:11:52

failed #412892
linux amd64
system:gcc:alpine3.10:amd64

00:12:20

failed #412856
amd64 linux
system:gcc:alpine3.10:amd64

00:12:30

failed #412881
linux amd64
system:gcc:bionic:amd64

00:11:21

failed #412867
amd64 linux
system:gcc:bionic:amd64

00:12:00

failed #412883
linux amd64
system:gcc:buster:amd64

00:11:46

failed #412862
amd64 linux
system:gcc:buster:amd64

00:12:08

failed #412857
amd64 linux
system:gcc:centos6:amd64

00:11:54

failed #412887
linux amd64
system:gcc:centos6:amd64

00:11:28

failed #412858
amd64 linux
system:gcc:centos7:amd64

00:12:03

failed #412886
linux amd64
system:gcc:centos7:amd64

00:11:31

failed #412859
amd64 linux
system:gcc:centos8:amd64

00:11:34

failed #412888
linux amd64
system:gcc:centos8:amd64

00:11:37

failed #412865
amd64 linux
system:gcc:fedora30:amd64

00:12:33

failed #412889
linux amd64
system:gcc:fedora30:amd64

00:12:03

failed #412860
amd64 linux
system:gcc:jessie:amd64

00:11:54

failed #412878
linux amd64
system:gcc:jessie:amd64

00:11:18

failed #412863
amd64 linux
system:gcc:sid:amd64

00:11:58

failed #412891
linux amd64
system:gcc:sid:amd64

00:12:05

failed #412885
linux i386
system:gcc:sid:i386

00:12:22

failed #412864
i386 linux
system:gcc:sid:i386

00:12:24

failed #412861
amd64 linux
system:gcc:stretch:amd64

00:11:43

failed #412877
linux amd64
system:gcc:stretch:amd64

00:11:16

failed #412880
linux amd64
system:gcc:xenial:amd64

00:10:44

failed #412866
amd64 linux
system:gcc:xenial:amd64

00:11:49

failed #412873
amd64 linux
system:nolibtool:sid:amd64

00:13:15

failed #412893
linux amd64
system:nolibtool:sid:amd64

00:12:57

failed #412870
amd64 linux
system:pkcs11:sid:amd64

00:12:49

failed #412894
linux amd64
system:pkcs11:sid:amd64

00:12:10

failed #412869
amd64 linux
system:rwlock:sid:amd64

00:12:26

failed #412884
linux amd64
system:rwlock:sid:amd64

00:11:57

 
  Docs
passed #412874
amd64 linux
docs:sid:amd64

00:01:10

 
  Postcheck
passed #412876
amd64 linux
cppcheck:gcc:sid:amd64

00:01:46

passed #412875
amd64 linux
scan-build:buster:amd64

00:11:05

 
Name Stage Failure
failed
system:gcc:buster:amd64 System The script exceeded the maximum execution time set for the job
I:resolver:failed
I:resolver:check logged command line (70)
I:resolver:exit status: 23
I:resolver:ns5 died before a SIGTERM was sent
R:resolver:FAIL
E:resolver:Fri Nov 15 17:40:57 UTC 2019
I:zero:successfully completed pass 1 of 10
Pulling docker image gitlab/gitlab-runner-helper:x86_64-05161b14 ...
ERROR: Job failed: execution took longer than 1h0m0s seconds
failed
system:asan:sid:amd64 System
I:     94 PASS
I:The following system tests failed:
I: resolver
I: zero
make: *** [Makefile:486: test] Error 1
Uploading artifacts...
untracked: found 1592 files
Uploading artifacts to coordinator... ok
id=412913 responseStatus=201 Created token=AxCZAxoQ
ERROR: Job failed: exit code 1
failed
system:nolibtool:sid:amd64 System
I:      1 FAIL
I: 95 PASS
I:The following system tests failed:
I: resolver
make: *** [Makefile:486: test] Error 1
Uploading artifacts...
untracked: found 916 files
Uploading artifacts to coordinator... ok
id=412912 responseStatus=201 Created token=Mryxsowp
ERROR: Job failed: exit code 1
failed
system:gcc:alpine3.10:amd64 System
I:     95 PASS
I:The following system tests failed:
I: pipelined
I: resolver
make: *** [Makefile:486: test] Error 1
Uploading artifacts...
untracked: found 1525 files
Uploading artifacts to coordinator... ok
id=412910 responseStatus=201 Created token=sbFB7okz
ERROR: Job failed: exit code 1
failed
system:pkcs11:sid:amd64 System
I:      2 SKIPPED
I:The following system tests failed:
I: resolver
I: rpzrecurse
make: *** [Makefile:486: test] Error 1
Uploading artifacts...
untracked: found 2877 files
Uploading artifacts to coordinator... ok
id=412911 responseStatus=201 Created token=UNHx5aFs
ERROR: Job failed: exit code 1
failed
system:gcc:fedora30:amd64 System
I:The following system tests failed:
I: autosign
I: resolver
I: rpzrecurse
make: *** [Makefile:486: test] Error 1
Uploading artifacts...
untracked: found 3353 files
Uploading artifacts to coordinator... ok
id=412908 responseStatus=201 Created token=8X4HHH84
ERROR: Job failed: exit code 1
failed
system:gcc:sid:amd64 System
I:      1 FAIL
I: 96 PASS
I:The following system tests failed:
I: resolver
make: *** [Makefile:486: test] Error 1
Uploading artifacts...
untracked: found 1545 files
Uploading artifacts to coordinator... ok
id=412909 responseStatus=201 Created token=o5mHsp1e
ERROR: Job failed: exit code 1
failed
system:gcc:sid:i386 System
I:      3 UNTESTED
I:The following system tests failed:
I: kasp
I: resolver
make: *** [Makefile:486: test] Error 1
Uploading artifacts...
untracked: found 2648 files
Uploading artifacts to coordinator... ok
id=412907 responseStatus=201 Created token=fmcphQL5
ERROR: Job failed: exit code 1
failed
system:rwlock:sid:amd64 System
I:     94 PASS
I:The following system tests failed:
I: resolver
I: zero
make: *** [Makefile:486: test] Error 1
Uploading artifacts...
untracked: found 1592 files
Uploading artifacts to coordinator... ok
id=412904 responseStatus=201 Created token=ELBEGh5s
ERROR: Job failed: exit code 1
failed
system:gcc:centos8:amd64 System
I:      1 FAIL
I: 95 PASS
I:The following system tests failed:
I: resolver
make: *** [Makefile:486: test] Error 1
Uploading artifacts...
untracked: found 1488 files
Uploading artifacts to coordinator... ok
id=412906 responseStatus=201 Created token=g7NrZXTj
ERROR: Job failed: exit code 1
failed
system:clang:freebsd11.3:amd64 System
I:      rrl
*** [test] Error code 1

make: stopped in /builds/isc-projects/bind9/bin/tests/system
Uploading artifacts...
Runtime platform arch=amd64 os=freebsd pid=94465 revision=de7731dd version=12.1.0
untracked: found 2914 files

Uploading artifacts to coordinator... ok
id=412902 responseStatus=201 Created token=vSkUX7kr
ERROR: Job failed: exit status 1
failed
system:gcc:centos6:amd64 System
I:The following system tests failed:
I: resolver
I: rpzrecurse
make: *** [test] Error 1
Authenticating with credentials from /root/.docker/config.json
Uploading artifacts...
untracked: found 2875 files

Uploading artifacts to coordinator... ok
id=412905 responseStatus=201 Created token=ZqgqKjrq
ERROR: Job failed: exit code 1
failed
system:gcc:centos7:amd64 System
I:      forward
I: kasp
I: resolver
I: rpzrecurse
make: *** [test] Error 1
Uploading artifacts...
untracked: found 4119 files
Uploading artifacts to coordinator... ok
id=412903 responseStatus=201 Created token=--Jt9ue8
ERROR: Job failed: exit code 1
failed
system:clang:freebsd12.0:amd64 System
I:      resolver
*** [test] Error code 1

make: stopped in /builds/isc-projects/bind9/bin/tests/system
Uploading artifacts...
Runtime platform arch=amd64 os=freebsd pid=85635 revision=de7731dd version=12.1.0
untracked: found 1468 files

Uploading artifacts to coordinator... ok
id=412900 responseStatus=201 Created token=84WxwMov
ERROR: Job failed: exit status 1
failed
system:gcc:bionic:amd64 System
I:The following system tests failed:
I: resolver
I: rpzrecurse
Makefile:484: recipe for target 'test' failed
make: *** [test] Error 1
Uploading artifacts...
untracked: found 2842 files
Uploading artifacts to coordinator... ok
id=412899 responseStatus=201 Created token=cUwsXvTk
ERROR: Job failed: exit code 1
failed
system:gcc:jessie:amd64 System
I:The following system tests failed:
I: resolver
I: rpzrecurse
make: *** [test] Error 1
Makefile:484: recipe for target 'test' failed
Uploading artifacts...
untracked: found 2585 files
Uploading artifacts to coordinator... ok
id=412898 responseStatus=201 Created token=MtUAH-jH
ERROR: Job failed: exit code 1
failed
system:gcc:stretch:amd64 System
I:      resolver
I: rpzrecurse
I: tcp
make: *** [test] Error 1
Makefile:484: recipe for target 'test' failed
Uploading artifacts...
untracked: found 4075 files
Uploading artifacts to coordinator... ok
id=412897 responseStatus=201 Created token=zfj8J1UT
ERROR: Job failed: exit code 1
failed
system:gcc:xenial:amd64 System
I:The following system tests failed:
I: resolver
I: rpzrecurse
make: *** [test] Error 1
Makefile:484: recipe for target 'test' failed
Uploading artifacts...
untracked: found 2874 files
Uploading artifacts to coordinator... ok
id=412896 responseStatus=201 Created token=siwh8jfy
ERROR: Job failed: exit code 1