Added system test for named-compilezone

Added a system test which ensures that named-compilezone works when
taking input data from stdin.
82 jobs for !2552 with 1279-named-compilezone-should-be-able-to-take-input-from-stdin in 40 minutes and 27 seconds (queued for 6 seconds)
detached
Status Job ID Name Coverage
  Precheck
passed #419365
amd64 linux
🐞:sid:amd64

00:03:26

passed #419363
amd64 linux
autoreconf:sid:amd64

00:00:32

failed #419364
amd64 linux
misc:sid:amd64

00:00:31

 
  Build
passed #419378
amd64 linux
asan:sid:amd64

00:02:05

passed #419384
amd64 freebsd
clang:freebsd11.3:amd64

00:01:32

passed #419385
amd64 freebsd
clang:freebsd12.0:amd64

00:01:19

passed #419386
amd64 openbsd
clang:openbsd6.5:amd64

00:04:55

passed #419381
amd64 linux
clang:stretch:amd64

00:02:12

passed #419382
i386 linux
clang:stretch:i386

00:03:18

passed #419366
amd64 linux
gcc:alpine3.10:amd64

00:02:56

passed #419377
amd64 linux
gcc:bionic:amd64

00:02:10

passed #419372
amd64 linux
gcc:buster:amd64

00:02:09

passed #419367
amd64 linux
gcc:centos6:amd64

00:02:17

passed #419368
amd64 linux
gcc:centos7:amd64

00:03:00

passed #419369
amd64 linux
gcc:centos8:amd64

00:02:33

passed #419375
amd64 linux
gcc:fedora30:amd64

00:02:31

passed #419370
amd64 linux
gcc:jessie:amd64

00:01:17

passed #419373
amd64 linux
gcc:sid:amd64

00:04:26

passed #419374
i386 linux
gcc:sid:i386

00:02:11

passed #419371
amd64 linux
gcc:stretch:amd64

00:01:34

passed #419376
amd64 linux
gcc:xenial:amd64

00:01:53

passed #419388
amd64 windows
msvc:windows:amd64

00:02:28

passed #419380
amd64 linux
mutexatomics:sid:amd64

00:02:10

passed #419387
amd64 linux
nolibtool:sid:amd64

00:02:24

passed #419383
amd64 linux
pkcs11:sid:amd64

00:01:57

passed #419379
amd64 linux
rwlock:sid:amd64

00:01:32

 
  Unit
passed #419401
amd64 linux
unit:asan:sid:amd64

00:04:38

failed #419405
amd64 freebsd
unit:clang:freebsd11.3:amd64

00:05:09

passed #419406
amd64 freebsd
unit:clang:freebsd12.0:amd64

00:01:20

passed #419403
amd64 linux
unit:clang:stretch:amd64

00:00:51

passed #419389
amd64 linux
unit:gcc:alpine3.10:amd64

00:02:31

passed #419400
amd64 linux
unit:gcc:bionic:amd64

00:00:56

passed #419395
amd64 linux
unit:gcc:buster:amd64

00:01:35

passed #419390
amd64 linux
unit:gcc:centos6:amd64

00:01:00

passed #419391
amd64 linux
unit:gcc:centos7:amd64

00:00:57

passed #419392
amd64 linux
unit:gcc:centos8:amd64

00:00:58

passed #419398
amd64 linux
unit:gcc:fedora30:amd64

00:01:31

passed #419393
amd64 linux
unit:gcc:jessie:amd64

00:00:29

passed #419396
amd64 linux
unit:gcc:sid:amd64

00:01:20

passed #419397
i386 linux
unit:gcc:sid:i386

00:02:05

passed #419394
amd64 linux
unit:gcc:stretch:amd64

00:00:52

passed #419399
amd64 linux
unit:gcc:xenial:amd64

00:00:55

passed #419407
amd64 linux
unit:nolibtool:sid:amd64

00:01:44

passed #419404
amd64 linux
unit:pkcs11:sid:amd64

00:01:25

passed #419402
amd64 linux
unit:rwlock:sid:amd64

00:01:28

 
  System
passed #419420
amd64 linux
system:asan:sid:amd64

00:10:28

passed #419514
amd64 freebsd
system:clang:freebsd11.3:amd64

00:09:06

failed #419513
amd64 freebsd
system:clang:freebsd12.0:amd64

00:09:21

passed #419442
linux amd64
system:gcc:alpine3.10:amd64

00:09:01

passed #419419
amd64 linux
system:gcc:bionic:amd64

00:07:06

passed #419435
linux amd64
system:gcc:buster:amd64

00:08:22

passed #419409
amd64 linux
system:gcc:centos6:amd64

00:08:13

passed #419410
amd64 linux
system:gcc:centos7:amd64

00:07:15

passed #419411
amd64 linux
system:gcc:centos8:amd64

00:08:21

passed #419441
linux amd64
system:gcc:fedora30:amd64

00:08:35

passed #419437
linux amd64
system:gcc:jessie:amd64

00:06:33

passed #419443
linux amd64
system:gcc:sid:amd64

00:07:08

passed #419440
linux i386
system:gcc:sid:i386

00:08:51

failed #419445
amd64 linux
system:gcc:stretch:amd64

00:08:31

failed #419658
amd64 linux
system:gcc:xenial:amd64

00:07:18

passed #419515
amd64 linux
system:nolibtool:sid:amd64

00:08:58

passed #419422
amd64 linux
system:pkcs11:sid:amd64

00:07:43

passed #419421
amd64 linux
system:rwlock:sid:amd64

00:09:19

failed #419439
freebsd amd64
system:clang:freebsd11.3:amd64

00:09:01

failed #419423
amd64 freebsd
system:clang:freebsd11.3:amd64

00:09:34

failed #419438
freebsd amd64
system:clang:freebsd12.0:amd64

00:08:55

failed #419424
amd64 freebsd
system:clang:freebsd12.0:amd64

00:09:41

failed #419408
amd64 linux
system:gcc:alpine3.10:amd64

00:09:49

failed #419414
amd64 linux
system:gcc:buster:amd64

00:07:50

failed #419417
amd64 linux
system:gcc:fedora30:amd64

00:09:13

failed #419412
amd64 linux
system:gcc:jessie:amd64

00:09:11

failed #419415
amd64 linux
system:gcc:sid:amd64

00:08:33

failed #419416
i386 linux
system:gcc:sid:i386

00:09:34

failed #419413
amd64 linux
system:gcc:stretch:amd64

00:08:23

failed #419434
linux amd64
system:gcc:stretch:amd64

00:07:10

failed #419418
amd64 linux
system:gcc:xenial:amd64

00:08:24

failed #419436
linux amd64
system:gcc:xenial:amd64

00:26:38

failed #419425
amd64 linux
system:nolibtool:sid:amd64

00:10:16

failed #419444
linux amd64
system:nolibtool:sid:amd64

00:09:53

 
  Docs
passed #419426
amd64 linux
docs:sid:amd64

00:01:04

 
  Postcheck
passed #419428
amd64 linux
cppcheck:gcc:sid:amd64

00:02:43

passed #419427
amd64 linux
scan-build:buster:amd64

00:11:31

 
Name Stage Failure
failed
system:gcc:xenial:amd64 System
I:The following system tests failed:
I: autosign
Makefile:484: recipe for target 'test' failed
make: *** [test] Error 1
Authenticating with credentials from /root/.docker/config.json
Uploading artifacts...
untracked: found 1824 files

Uploading artifacts to coordinator... ok
id=419658 responseStatus=201 Created token=HzDvPvhe
ERROR: Job failed: exit code 1
failed
system:clang:freebsd12.0:amd64 System
I:      mkeys
*** [test] Error code 1

make: stopped in /builds/isc-projects/bind9/bin/tests/system
Uploading artifacts...
Runtime platform arch=amd64 os=freebsd pid=23191 revision=de7731dd version=12.1.0
untracked: found 1431 files

Uploading artifacts to coordinator... ok
id=419513 responseStatus=201 Created token=syMs11VU
ERROR: Job failed: exit status 1
failed
system:gcc:stretch:amd64 System
I:      1 SKIPPED
I:The following system tests failed:
I: mkeys
make: *** [test] Error 1
Makefile:484: recipe for target 'test' failed
Uploading artifacts...
untracked: found 1420 files
Uploading artifacts to coordinator... ok
id=419445 responseStatus=201 Created token=thAxsCRZ
ERROR: Job failed: exit code 1
failed
unit:clang:freebsd11.3:amd64 Unit
Generating kyua_html/report.css
Generating kyua_html/index.html
Uploading artifacts...
Runtime platform arch=amd64 os=freebsd pid=45922 revision=de7731dd version=12.1.0
kyua.log: found 1 matching files

kyua.results: found 1 matching files

kyua_html/: found 70 matching files

Uploading artifacts to coordinator... ok
id=419405 responseStatus=201 Created token=N2kMAKHe
ERROR: Job failed: exit status 1
failed
misc:sid:amd64 Precheck
$ rm util/newcopyrights
$ perl -w util/update_copyrights < util/copyrights
./bin/tests/system/compilezone/zones/zone1.raw: type '?' not supported yet; skipping
Authenticating with credentials from /root/.docker/config.json
Uploading artifacts...
WARNING: util/newcopyrights: no matching files
checklibs.out: found 1 matching files

Uploading artifacts to coordinator... ok
id=419364 responseStatus=201 Created token=Bm6qWZnu
ERROR: Job failed: exit code 1