don't lock rbtdb->tree_lock in detachnode

Status Job ID Name Coverage
  Precheck
passed #476908
amd64 linux
🐞:sid:amd64

00:03:43

passed #476906
amd64 linux
autoreconf:sid:amd64

00:00:36

passed #476907
amd64 linux
misc:sid:amd64

00:00:17

 
  Build
passed #476921
amd64 linux
asan:sid:amd64

00:02:06

passed #476928
amd64 freebsd
clang:freebsd11.3:amd64

00:01:10

passed #476929
amd64 freebsd
clang:freebsd12.0:amd64

00:00:59

passed #476930
amd64 openbsd
clang:openbsd6.5:amd64

00:06:56

passed #476925
amd64 linux
clang:stretch:amd64

00:01:33

passed #476926
i386 linux
clang:stretch:i386

00:01:48

passed #476909
amd64 linux
gcc:alpine3.10:amd64

00:02:17

passed #476920
amd64 linux
gcc:bionic:amd64

00:01:20

passed #476915
amd64 linux
gcc:buster:amd64

00:01:30

passed #476910
amd64 linux
gcc:centos6:amd64

00:01:48

passed #476911
amd64 linux
gcc:centos7:amd64

00:02:09

passed #476912
amd64 linux
gcc:centos8:amd64

00:02:38

passed #476918
amd64 linux
gcc:fedora31:amd64

00:02:25

passed #476913
amd64 linux
gcc:jessie:amd64

00:01:37

passed #476916
amd64 linux
gcc:sid:amd64

00:02:25

passed #476917
i386 linux
gcc:sid:i386

00:01:57

passed #476914
amd64 linux
gcc:stretch:amd64

00:01:25

passed #476919
amd64 linux
gcc:xenial:amd64

00:01:21

passed #476932
amd64 windows
msvc:windows:amd64

00:04:46

passed #476924
amd64 linux
mutexatomics:sid:amd64

00:01:33

passed #476931
amd64 linux
nolibtool:sid:amd64

00:02:35

passed #476927
amd64 linux
pkcs11:sid:amd64

00:01:38

passed #476923
amd64 linux
rwlock:sid:amd64

00:01:34

passed #476922
amd64 linux
tsan:buster:amd64

00:03:12

 
  Unit
passed #476945
amd64 linux
unit:asan:sid:amd64

00:04:05

passed #476950
amd64 freebsd
unit:clang:freebsd11.3:amd64

00:00:36

passed #476951
amd64 freebsd
unit:clang:freebsd12.0:amd64

00:01:09

passed #476948
amd64 linux
unit:clang:stretch:amd64

00:00:39

passed #476933
amd64 linux
unit:gcc:alpine3.10:amd64

00:02:40

passed #476944
amd64 linux
unit:gcc:bionic:amd64

00:00:39

passed #476939
amd64 linux
unit:gcc:buster:amd64

00:01:10

passed #476934
amd64 linux
unit:gcc:centos6:amd64

00:00:54

passed #476935
amd64 linux
unit:gcc:centos7:amd64

00:00:56

passed #476936
amd64 linux
unit:gcc:centos8:amd64

00:00:40

passed #476942
amd64 linux
unit:gcc:fedora31:amd64

00:01:18

passed #476937
amd64 linux
unit:gcc:jessie:amd64

00:00:20

passed #476940
amd64 linux
unit:gcc:sid:amd64

00:01:25

passed #476941
i386 linux
unit:gcc:sid:i386

00:01:53

passed #476938
amd64 linux
unit:gcc:stretch:amd64

00:00:52

passed #476943
amd64 linux
unit:gcc:xenial:amd64

00:01:00

passed #476952
amd64 linux
unit:nolibtool:sid:amd64

00:01:33

passed #476949
amd64 linux
unit:pkcs11:sid:amd64

00:01:16

passed #476947
amd64 linux
unit:rwlock:sid:amd64

00:01:21

failed #476946
amd64 linux allowed to fail
unit:tsan:buster:amd64

00:05:26

 
  System
passed #476965
amd64 linux
system:asan:sid:amd64

00:10:53

passed #476969
amd64 freebsd
system:clang:freebsd11.3:amd64

00:08:26

passed #476970
amd64 freebsd
system:clang:freebsd12.0:amd64

00:08:21

passed #476953
amd64 linux
system:gcc:alpine3.10:amd64

00:10:47

passed #476964
amd64 linux
system:gcc:bionic:amd64

00:09:04

passed #476959
amd64 linux
system:gcc:buster:amd64

00:07:54

passed #476954
amd64 linux
system:gcc:centos6:amd64

00:09:01

passed #476955
amd64 linux
system:gcc:centos7:amd64

00:09:33

passed #476956
amd64 linux
system:gcc:centos8:amd64

00:07:48

passed #476962
amd64 linux
system:gcc:fedora31:amd64

00:09:08

passed #476957
amd64 linux
system:gcc:jessie:amd64

00:07:22

passed #476960
amd64 linux
system:gcc:sid:amd64

00:09:22

passed #476961
i386 linux
system:gcc:sid:i386

00:09:17

failed #476958
amd64 linux
system:gcc:stretch:amd64

00:09:38

passed #476963
amd64 linux
system:gcc:xenial:amd64

00:07:14

failed #476971
amd64 linux
system:nolibtool:sid:amd64

00:10:30

passed #476968
amd64 linux
system:pkcs11:sid:amd64

00:08:16

passed #476967
amd64 linux
system:rwlock:sid:amd64

00:09:10

failed #476966
amd64 linux allowed to fail
system:tsan:buster:amd64

00:14:48

 
  Docs
passed #476972
amd64 linux
docs:sid:amd64

00:00:47

 
  Postcheck
passed #476974
amd64 linux
cppcheck:gcc:sid:amd64

00:01:49

passed #476973
amd64 linux
scan-build:buster:amd64

00:11:43

 
Name Stage Failure
failed
unit:tsan:buster:amd64 Unit
$ find lib -name 'tsan.*' -exec python3 util/parse_tsan.py {} \;
Uploading artifacts...
WARNING: lib/*/tests/tsan.*: no matching files
WARNING: tsan/: no matching files
kyua.log: found 1 matching files

kyua.results: found 1 matching files

WARNING: kyua_html/: no matching files
Uploading artifacts to coordinator... ok
id=476946 responseStatus=201 Created token=QEdJSzqt
ERROR: Job failed: exit code 1
failed
system:tsan:buster:amd64 System
make: *** [Makefile:486: test] Error 1
Running after script...
$ find bin -name 'tsan.*' -exec python3 util/parse_tsan.py {} \;
Uploading artifacts...
bin/tests/system/*/tsan.*: found 20 matching files
bin/tests/system/*/*/tsan.*: found 267 matching files

tsan/: found 280 matching files

Uploading artifacts to coordinator... ok
id=476966 responseStatus=201 Created token=x4DtQZx7
ERROR: Job failed: exit code 1
failed
system:nolibtool:sid:amd64 System
I:      1 FAIL
I: 97 PASS
I:The following system tests failed:
I: dnssec
make: *** [Makefile:486: test] Error 1
Uploading artifacts...
untracked: found 1704 files
Uploading artifacts to coordinator... ok
id=476971 responseStatus=201 Created token=mSjNAGsr
ERROR: Job failed: exit code 1
failed
system:gcc:stretch:amd64 System
I:      1 SKIPPED
I:The following system tests failed:
I: fetchlimit
Makefile:484: recipe for target 'test' failed
make: *** [test] Error 1
Uploading artifacts...
untracked: found 1336 files
Uploading artifacts to coordinator... ok
id=476958 responseStatus=201 Created token=YVoBTTHk
ERROR: Job failed: exit code 1