have write lock before setting RDATASET_ATTR_STALE in mark_header_stale

Status Job ID Name Coverage
  Precheck
passed #482348
amd64 linux
🐞:sid:amd64

00:03:16

passed #482346
amd64 linux
autoreconf:sid:amd64

00:00:33

passed #482347
amd64 linux
misc:sid:amd64

00:00:17

 
  Build
passed #482361
amd64 linux
asan:sid:amd64

00:02:16

passed #482368
amd64 freebsd
clang:freebsd11.3:amd64

00:01:20

passed #482369
amd64 freebsd
clang:freebsd12.0:amd64

00:01:10

passed #482370
amd64 openbsd
clang:openbsd6.5:amd64

00:05:58

passed #482365
amd64 linux
clang:stretch:amd64

00:01:46

passed #482366
i386 linux
clang:stretch:i386

00:00:57

passed #482349
amd64 linux
gcc:alpine3.10:amd64

00:02:21

passed #482360
amd64 linux
gcc:bionic:amd64

00:02:07

passed #482355
amd64 linux
gcc:buster:amd64

00:01:38

passed #482350
amd64 linux
gcc:centos6:amd64

00:02:23

passed #482351
amd64 linux
gcc:centos7:amd64

00:02:38

passed #482352
amd64 linux
gcc:centos8:amd64

00:02:16

passed #482358
amd64 linux
gcc:fedora31:amd64

00:02:54

passed #482353
amd64 linux
gcc:jessie:amd64

00:01:42

passed #482356
amd64 linux
gcc:sid:amd64

00:03:01

passed #482357
i386 linux
gcc:sid:i386

00:02:09

passed #482354
amd64 linux
gcc:stretch:amd64

00:02:05

passed #482359
amd64 linux
gcc:xenial:amd64

00:02:08

passed #482372
amd64 windows
msvc:windows:amd64

00:05:20

passed #482364
amd64 linux
mutexatomics:sid:amd64

00:01:44

passed #482371
amd64 linux
nolibtool:sid:amd64

00:02:17

passed #482367
amd64 linux
pkcs11:sid:amd64

00:01:42

passed #482363
amd64 linux
rwlock:sid:amd64

00:01:58

passed #482362
amd64 linux
tsan:buster:amd64

00:03:38

 
  Unit
passed #482385
amd64 linux
unit:asan:sid:amd64

00:04:46

passed #482390
amd64 freebsd
unit:clang:freebsd11.3:amd64

00:00:27

passed #482391
amd64 freebsd
unit:clang:freebsd12.0:amd64

00:01:08

passed #482388
amd64 linux
unit:clang:stretch:amd64

00:00:39

passed #482373
amd64 linux
unit:gcc:alpine3.10:amd64

00:02:42

passed #482384
amd64 linux
unit:gcc:bionic:amd64

00:01:01

passed #482379
amd64 linux
unit:gcc:buster:amd64

00:01:16

passed #482374
amd64 linux
unit:gcc:centos6:amd64

00:00:56

passed #482375
amd64 linux
unit:gcc:centos7:amd64

00:00:42

passed #482376
amd64 linux
unit:gcc:centos8:amd64

00:00:58

passed #482382
amd64 linux
unit:gcc:fedora31:amd64

00:01:16

passed #482377
amd64 linux
unit:gcc:jessie:amd64

00:00:33

passed #482380
amd64 linux
unit:gcc:sid:amd64

00:01:09

passed #482381
i386 linux
unit:gcc:sid:i386

00:02:05

passed #482378
amd64 linux
unit:gcc:stretch:amd64

00:00:44

passed #482383
amd64 linux
unit:gcc:xenial:amd64

00:01:00

passed #482392
amd64 linux
unit:nolibtool:sid:amd64

00:01:43

passed #482389
amd64 linux
unit:pkcs11:sid:amd64

00:01:24

failed #482387
amd64 linux
unit:rwlock:sid:amd64

00:01:11

failed #482386
amd64 linux allowed to fail
unit:tsan:buster:amd64

00:04:26

 
  System
passed #482405
amd64 linux
system:asan:sid:amd64

00:10:39

passed #482409
amd64 freebsd
system:clang:freebsd11.3:amd64

00:08:19

failed #482410
amd64 freebsd
system:clang:freebsd12.0:amd64

00:08:25

passed #482393
amd64 linux
system:gcc:alpine3.10:amd64

00:10:00

passed #482404
amd64 linux
system:gcc:bionic:amd64

00:08:07

passed #482399
amd64 linux
system:gcc:buster:amd64

00:08:40

passed #482394
amd64 linux
system:gcc:centos6:amd64

00:09:03

passed #482395
amd64 linux
system:gcc:centos7:amd64

00:08:07

passed #482396
amd64 linux
system:gcc:centos8:amd64

00:09:24

passed #482402
amd64 linux
system:gcc:fedora31:amd64

00:08:24

passed #482397
amd64 linux
system:gcc:jessie:amd64

00:06:54

passed #482400
amd64 linux
system:gcc:sid:amd64

00:07:41

passed #482401
i386 linux
system:gcc:sid:i386

00:08:11

passed #482398
amd64 linux
system:gcc:stretch:amd64

00:08:19

passed #482403
amd64 linux
system:gcc:xenial:amd64

00:06:44

passed #482411
amd64 linux
system:nolibtool:sid:amd64

00:08:14

failed #482408
amd64 linux
system:pkcs11:sid:amd64

00:08:16

failed #482407
amd64 linux
system:rwlock:sid:amd64

00:08:09

failed #482406
amd64 linux allowed to fail
system:tsan:buster:amd64

00:12:52

 
  Docs
passed #482412
amd64 linux
docs:sid:amd64

00:00:33

 
  Postcheck
passed #482414
amd64 linux
cppcheck:gcc:sid:amd64

00:01:24

passed #482413
amd64 linux
scan-build:buster:amd64

00:11:40

 
Name Stage Failure
failed
system:tsan:buster:amd64 System
make: *** [Makefile:486: test] Error 1
Running after script...
$ find bin -name 'tsan.*' -exec python3 util/parse_tsan.py {} \;
Uploading artifacts...
bin/tests/system/*/tsan.*: found 19 matching files
bin/tests/system/*/*/tsan.*: found 266 matching files

tsan/: found 276 matching files

Uploading artifacts to coordinator... ok
id=482406 responseStatus=201 Created token=N6Q6_giM
ERROR: Job failed: exit code 1
failed
system:rwlock:sid:amd64 System
I:      1 FAIL
I: 97 PASS
I:The following system tests failed:
I: serve-stale
make: *** [Makefile:486: test] Error 1
Uploading artifacts...
untracked: found 1433 files
Uploading artifacts to coordinator... ok
id=482407 responseStatus=201 Created token=WLLQ9CRq
ERROR: Job failed: exit code 1
failed
system:pkcs11:sid:amd64 System
I:      1 PKCS11ONLY
I: 2 SKIPPED
I:The following system tests failed:
I: legacy
make: *** [Makefile:486: test] Error 1
Uploading artifacts...
untracked: found 1419 files
Uploading artifacts to coordinator... ok
id=482408 responseStatus=201 Created token=ZA_LDtE9
ERROR: Job failed: exit code 1
failed
system:clang:freebsd12.0:amd64 System
I:      nsupdate
*** [test] Error code 1

make: stopped in /builds/isc-projects/bind9/bin/tests/system
Uploading artifacts...
Runtime platform arch=amd64 os=freebsd pid=88840 revision=de7731dd version=12.1.0
untracked: found 1542 files

Uploading artifacts to coordinator... ok
id=482410 responseStatus=201 Created token=JGzUpYmo
ERROR: Job failed: exit status 1
failed
unit:tsan:buster:amd64 Unit
$ find lib -name 'tsan.*' -exec python3 util/parse_tsan.py {} \;
Uploading artifacts...
lib/*/tests/tsan.*: found 1 matching files
tsan/: found 5 matching files

kyua.log: found 1 matching files

kyua.results: found 1 matching files

WARNING: kyua_html/: no matching files
Uploading artifacts to coordinator... ok
id=482386 responseStatus=201 Created token=ADBrq22i
ERROR: Job failed: exit code 1
failed
unit:rwlock:sid:amd64 Unit
Generating kyua_html/lib_ns_tests_query_test_main.html
Generating kyua_html/report.css
Generating kyua_html/index.html
Uploading artifacts...
kyua.log: found 1 matching files
kyua.results: found 1 matching files

kyua_html/: found 70 matching files

Uploading artifacts to coordinator... ok
id=482387 responseStatus=201 Created token=QvDqEc9t
ERROR: Job failed: exit code 1