wait longer for dynamic zone to be transfered

69 jobs for !2774 with 1508-case-system-test-failed in 17 minutes and 41 seconds (queued for 13 seconds)
detached
Status Job ID Name Coverage
  Precheck
passed #486024
amd64 linux
🐞:sid:amd64

00:04:00

passed #486022
amd64 linux
autoreconf:sid:amd64

00:00:33

passed #486023
amd64 linux
misc:sid:amd64

00:00:18

 
  Build
passed #486037
amd64 linux
asan:sid:amd64

00:01:36

passed #486044
amd64 freebsd
clang:freebsd11.3:amd64

00:01:14

passed #486045
amd64 freebsd
clang:freebsd12.0:amd64

00:01:05

passed #486046
amd64 openbsd
clang:openbsd6.5:amd64

00:06:55

passed #486041
amd64 linux
clang:stretch:amd64

00:01:17

passed #486042
i386 linux
clang:stretch:i386

00:01:40

passed #486025
amd64 linux
gcc:alpine3.10:amd64

00:02:34

passed #486036
amd64 linux
gcc:bionic:amd64

00:01:11

passed #486031
amd64 linux
gcc:buster:amd64

00:01:29

passed #486026
amd64 linux
gcc:centos6:amd64

00:02:03

passed #486027
amd64 linux
gcc:centos7:amd64

00:02:10

passed #486028
amd64 linux
gcc:centos8:amd64

00:02:32

passed #486034
amd64 linux
gcc:fedora31:amd64

00:02:15

passed #486029
amd64 linux
gcc:jessie:amd64

00:01:24

passed #486032
amd64 linux
gcc:sid:amd64

00:02:18

passed #486033
i386 linux
gcc:sid:i386

00:01:41

passed #486030
amd64 linux
gcc:stretch:amd64

00:01:28

passed #486035
amd64 linux
gcc:xenial:amd64

00:01:26

passed #486048
amd64 windows
msvc:windows:amd64

00:02:47

passed #486040
amd64 linux
mutexatomics:sid:amd64

00:01:35

passed #486047
amd64 linux
nolibtool:sid:amd64

00:01:51

passed #486043
amd64 linux
pkcs11:sid:amd64

00:01:23

passed #486039
amd64 linux
rwlock:sid:amd64

00:01:11

passed #486038
amd64 linux
tsan:buster:amd64

00:03:00

 
  Unit
passed #486061
amd64 linux
unit:asan:sid:amd64

00:05:01

passed #486066
amd64 freebsd
unit:clang:freebsd11.3:amd64

00:00:32

passed #486067
amd64 freebsd
unit:clang:freebsd12.0:amd64

00:01:18

passed #486064
amd64 linux
unit:clang:stretch:amd64

00:00:54

passed #486049
amd64 linux
unit:gcc:alpine3.10:amd64

00:02:44

passed #486060
amd64 linux
unit:gcc:bionic:amd64

00:00:40

passed #486055
amd64 linux
unit:gcc:buster:amd64

00:01:24

passed #486050
amd64 linux
unit:gcc:centos6:amd64

00:00:56

passed #486051
amd64 linux
unit:gcc:centos7:amd64

00:00:57

passed #486052
amd64 linux
unit:gcc:centos8:amd64

00:00:40

passed #486058
amd64 linux
unit:gcc:fedora31:amd64

00:01:22

passed #486053
amd64 linux
unit:gcc:jessie:amd64

00:00:29

passed #486056
amd64 linux
unit:gcc:sid:amd64

00:01:34

passed #486057
i386 linux
unit:gcc:sid:i386

00:02:01

passed #486054
amd64 linux
unit:gcc:stretch:amd64

00:00:55

passed #486059
amd64 linux
unit:gcc:xenial:amd64

00:00:56

passed #486068
amd64 linux
unit:nolibtool:sid:amd64

00:01:28

passed #486065
amd64 linux
unit:pkcs11:sid:amd64

00:01:36

passed #486063
amd64 linux
unit:rwlock:sid:amd64

00:01:14

failed #486062
amd64 linux allowed to fail
unit:tsan:buster:amd64

00:05:03

 
  System
passed #486081
amd64 linux
system:asan:sid:amd64

00:12:43

failed #486085
amd64 freebsd
system:clang:freebsd11.3:amd64

00:09:33

failed #486086
amd64 freebsd
system:clang:freebsd12.0:amd64

00:09:16

passed #486069
amd64 linux
system:gcc:alpine3.10:amd64

00:09:56

passed #486080
amd64 linux
system:gcc:bionic:amd64

00:09:25

passed #486075
amd64 linux
system:gcc:buster:amd64

00:09:52

passed #486070
amd64 linux
system:gcc:centos6:amd64

00:09:24

passed #486071
amd64 linux
system:gcc:centos7:amd64

00:08:45

passed #486072
amd64 linux
system:gcc:centos8:amd64

00:09:32

passed #486078
amd64 linux
system:gcc:fedora31:amd64

00:09:05

failed #486073
amd64 linux
system:gcc:jessie:amd64

00:09:20

passed #486076
amd64 linux
system:gcc:sid:amd64

00:09:19

passed #486077
i386 linux
system:gcc:sid:i386

00:09:39

passed #486074
amd64 linux
system:gcc:stretch:amd64

00:09:02

passed #486079
amd64 linux
system:gcc:xenial:amd64

00:08:11

passed #486087
amd64 linux
system:nolibtool:sid:amd64

00:09:14

passed #486084
amd64 linux
system:pkcs11:sid:amd64

00:09:05

passed #486083
amd64 linux
system:rwlock:sid:amd64

00:09:17

failed #486082
amd64 linux allowed to fail
system:tsan:buster:amd64

00:12:30

 
  Docs
passed #486088
amd64 linux
docs:sid:amd64

00:00:59

 
  Postcheck
passed #486090
amd64 linux
cppcheck:gcc:sid:amd64

00:01:54

passed #486089
amd64 linux
scan-build:buster:amd64

00:12:28

 
Name Stage Failure
failed
system:tsan:buster:amd64 System
make: *** [Makefile:486: test] Error 1
Running after script...
$ find bin -name 'tsan.*' -exec python3 util/parse_tsan.py {} \;
Uploading artifacts...
bin/tests/system/*/tsan.*: found 18 matching files
bin/tests/system/*/*/tsan.*: found 266 matching files

tsan/: found 266 matching files

Uploading artifacts to coordinator... ok
id=486082 responseStatus=201 Created token=eP-pfzzw
ERROR: Job failed: exit code 1
failed
system:gcc:jessie:amd64 System
I:      2 SKIPPED
I:The following system tests failed:
I: mkeys
make: *** [test] Error 1
Makefile:484: recipe for target 'test' failed
Uploading artifacts...
untracked: found 1169 files
Uploading artifacts to coordinator... ok
id=486073 responseStatus=201 Created token=gV6Cz8zC
ERROR: Job failed: exit code 1
failed
system:clang:freebsd11.3:amd64 System
I:      inline
*** [test] Error code 1

make: stopped in /builds/isc-projects/bind9/bin/tests/system
Uploading artifacts...
Runtime platform arch=amd64 os=freebsd pid=32860 revision=de7731dd version=12.1.0
untracked: found 1744 files

Uploading artifacts to coordinator... ok
id=486085 responseStatus=201 Created token=1_pAjzNN
ERROR: Job failed: exit status 1
failed
system:clang:freebsd12.0:amd64 System
I:      dnstap
*** [test] Error code 1

make: stopped in /builds/isc-projects/bind9/bin/tests/system
Uploading artifacts...
Runtime platform arch=amd64 os=freebsd pid=19077 revision=de7731dd version=12.1.0
untracked: found 1353 files

Uploading artifacts to coordinator... ok
id=486086 responseStatus=201 Created token=Q7m44scT
ERROR: Job failed: exit status 1
failed
unit:tsan:buster:amd64 Unit
$ find lib -name 'tsan.*' -exec python3 util/parse_tsan.py {} \;
Uploading artifacts...
WARNING: lib/*/tests/tsan.*: no matching files
WARNING: tsan/: no matching files
kyua.log: found 1 matching files

kyua.results: found 1 matching files

WARNING: kyua_html/: no matching files
Uploading artifacts to coordinator... ok
id=486062 responseStatus=201 Created token=rqjp5pvR
ERROR: Job failed: exit code 1