Retry sending response in ans.py in qmin test

243 jobs for !2944 with wpk/fix-qmin-test in 47 minutes and 22 seconds (queued for 4 seconds)
detached
Status Job ID Name Coverage
  Precheck
passed #592304
amd64 linux
🐞:sid:amd64

00:03:25

passed #592302
amd64 linux
autoreconf:sid:amd64

00:00:33

passed #592303
amd64 linux
misc:sid:amd64

00:00:23

 
  Build
passed #592319
amd64 linux
asan:sid:amd64

00:02:16

passed #592326
amd64 freebsd
clang:freebsd11.3:amd64

00:01:08

passed #592327
amd64 freebsd
clang:freebsd12.0:amd64

00:00:59

passed #592328
amd64 openbsd
clang:openbsd6.5:amd64

00:04:44

passed #592323
amd64 linux
clang:stretch:amd64

00:01:08

passed #592324
i386 linux
clang:stretch:i386

00:01:45

passed #592305
amd64 linux
gcc:alpine3.11:amd64

00:02:35

passed #592318
amd64 linux
gcc:bionic:amd64

00:01:44

passed #592311
amd64 linux
gcc:buster:amd64

00:01:40

passed #592306
amd64 linux
gcc:centos6:amd64

00:02:12

passed #592307
amd64 linux
gcc:centos7:amd64

00:02:17

passed #592308
amd64 linux
gcc:centos8:amd64

00:01:49

passed #592316
amd64 linux
gcc:fedora31:amd64

00:02:25

passed #592309
amd64 linux
gcc:jessie:amd64

00:01:37

passed #592312
amd64 linux
gcc:sid:amd64

00:02:13

passed #592314
i386 linux
gcc:sid:i386

00:01:52

passed #592310
amd64 linux
gcc:stretch:amd64

00:01:55

passed #592315
amd64 linux
gcc:tumbleweed:amd64

00:01:47

passed #592317
amd64 linux
gcc:xenial:amd64

00:01:41

passed #592330
amd64 windows
msvc:windows:amd64

00:02:11

passed #592322
amd64 linux
mutexatomics:sid:amd64

00:01:50

passed #592329
amd64 linux
nolibtool:sid:amd64

00:02:19

passed #592313
amd64 linux
oot:sid:amd64

00:01:16

passed #592325
amd64 linux
pkcs11:sid:amd64

00:01:02

passed #592321
amd64 linux
rwlock:sid:amd64

00:01:20

passed #592320
amd64 linux
tsan:buster:amd64

00:03:14

 
  Unit
passed #592344
amd64 linux
unit:asan:sid:amd64

00:04:05

passed #592349
amd64 freebsd
unit:clang:freebsd11.3:amd64

00:00:36

passed #592350
amd64 freebsd
unit:clang:freebsd12.0:amd64

00:01:08

passed #592347
amd64 linux
unit:clang:stretch:amd64

00:00:51

passed #592331
amd64 linux
unit:gcc:alpine3.11:amd64

00:02:46

passed #592343
amd64 linux
unit:gcc:bionic:amd64

00:00:40

passed #592337
amd64 linux
unit:gcc:buster:amd64

00:01:12

passed #592332
amd64 linux
unit:gcc:centos6:amd64

00:01:01

passed #592333
amd64 linux
unit:gcc:centos7:amd64

00:01:01

passed #592334
amd64 linux
unit:gcc:centos8:amd64

00:00:55

passed #592341
amd64 linux
unit:gcc:fedora31:amd64

00:01:24

passed #592335
amd64 linux
unit:gcc:jessie:amd64

00:00:15

passed #592338
amd64 linux
unit:gcc:sid:amd64

00:01:25

passed #592339
i386 linux
unit:gcc:sid:i386

00:02:03

passed #592336
amd64 linux
unit:gcc:stretch:amd64

00:00:52

passed #592340
amd64 linux
unit:gcc:tumbleweed:amd64

00:01:25

passed #592342
amd64 linux
unit:gcc:xenial:amd64

00:00:54

passed #592351
amd64 linux
unit:nolibtool:sid:amd64

00:01:40

passed #592348
amd64 linux
unit:pkcs11:sid:amd64

00:01:04

passed #592346
amd64 linux
unit:rwlock:sid:amd64

00:01:10

failed #592345
amd64 linux allowed to fail
unit:tsan:buster:amd64

00:03:58

 
  System
passed #592947
amd64 linux
system:asan:sid:amd64

00:13:33

failed #592928
freebsd amd64
system:clang:freebsd11.3:amd64

00:12:12

failed #592929
freebsd amd64
system:clang:freebsd12.0:amd64

00:12:16

failed #592930
linux amd64
system:gcc:alpine3.11:amd64

00:14:24

passed #592931
linux amd64
system:gcc:bionic:amd64

00:10:41

passed #592932
linux amd64
system:gcc:buster:amd64

00:11:39

passed #592933
linux amd64
system:gcc:centos6:amd64

00:10:31

passed #592934
linux amd64
system:gcc:centos7:amd64

00:10:35

passed #592935
linux amd64
system:gcc:centos8:amd64

00:10:46

passed #592937
linux amd64
system:gcc:fedora31:amd64

00:11:09

passed #592936
linux amd64
system:gcc:jessie:amd64

00:10:14

passed #592938
linux amd64
system:gcc:sid:amd64

00:11:24

passed #592945
linux i386
system:gcc:sid:i386

00:11:25

passed #592939
linux amd64
system:gcc:stretch:amd64

00:10:14

passed #592940
linux amd64
system:gcc:tumbleweed:amd64

00:11:14

passed #592944
linux amd64
system:gcc:xenial:amd64

00:10:09

passed #592943
linux amd64
system:nolibtool:sid:amd64

00:11:58

passed #592942
linux amd64
system:pkcs11:sid:amd64

00:11:26

passed #592941
amd64 linux
system:rwlock:sid:amd64

00:11:14

failed #592766
linux amd64 allowed to fail
system:tsan:buster:amd64

00:15:55

passed #592497
amd64 linux
system:asan:sid:amd64

00:13:09

passed #592365
amd64 linux
system:asan:sid:amd64

00:13:15

passed #592772
amd64 linux
system:asan:sid:amd64

00:13:26

passed #592872
linux amd64
system:asan:sid:amd64

00:12:51

passed #592397
linux amd64
system:asan:sid:amd64

00:13:17

passed #592747
linux amd64
system:asan:sid:amd64

00:13:10

failed #592927
linux amd64
system:asan:sid:amd64

00:13:33

passed #592908
amd64 linux
system:asan:sid:amd64

00:13:12

passed #592773
freebsd amd64
system:clang:freebsd11.3:amd64

00:11:58

passed #592396
freebsd amd64
system:clang:freebsd11.3:amd64

00:11:49

passed #592369
amd64 freebsd
system:clang:freebsd11.3:amd64

00:11:47

passed #592748
amd64 freebsd
system:clang:freebsd11.3:amd64

00:11:54

passed #592519
freebsd amd64
system:clang:freebsd11.3:amd64

00:11:41

passed #592923
amd64 freebsd
system:clang:freebsd11.3:amd64

00:12:01

passed #592907
freebsd amd64
system:clang:freebsd11.3:amd64

00:11:43

passed #592496
amd64 freebsd
system:clang:freebsd11.3:amd64

00:12:05

passed #592889
amd64 freebsd
system:clang:freebsd11.3:amd64

00:11:50

passed #592395
freebsd amd64
system:clang:freebsd12.0:amd64

00:11:51

passed #592749
amd64 freebsd
system:clang:freebsd12.0:amd64

00:12:02

passed #592924
amd64 freebsd
system:clang:freebsd12.0:amd64

00:11:51

passed #592495
amd64 freebsd
system:clang:freebsd12.0:amd64

00:12:13

passed #592906
freebsd amd64
system:clang:freebsd12.0:amd64

00:11:47

passed #592370
amd64 freebsd
system:clang:freebsd12.0:amd64

00:11:56

failed #592518
freebsd amd64
system:clang:freebsd12.0:amd64

00:11:55

failed #592888
amd64 freebsd
system:clang:freebsd12.0:amd64

00:12:00

passed #592774
freebsd amd64
system:clang:freebsd12.0:amd64

00:12:08

passed #592905
linux amd64
system:gcc:alpine3.11:amd64

00:11:47

passed #592394
linux amd64
system:gcc:alpine3.11:amd64

00:11:52

passed #592352
amd64 linux
system:gcc:alpine3.11:amd64

00:12:10

passed #592521
linux amd64
system:gcc:alpine3.11:amd64

00:12:31

passed #592925
amd64 linux
system:gcc:alpine3.11:amd64

00:11:47

passed #592887
amd64 linux
system:gcc:alpine3.11:amd64

00:12:08

passed #592775
linux amd64
system:gcc:alpine3.11:amd64

00:12:46

passed #592752
amd64 linux
system:gcc:alpine3.11:amd64

00:12:09

passed #592494
amd64 linux
system:gcc:alpine3.11:amd64

00:12:22

passed #592922
amd64 linux
system:gcc:bionic:amd64

00:10:06

passed #592364
amd64 linux
system:gcc:bionic:amd64

00:11:10

passed #592750
amd64 linux
system:gcc:bionic:amd64

00:10:14

passed #592904
linux amd64
system:gcc:bionic:amd64

00:09:10

passed #592393
linux amd64
system:gcc:bionic:amd64

00:10:07

passed #592886
amd64 linux
system:gcc:bionic:amd64

00:09:41

passed #592493
amd64 linux
system:gcc:bionic:amd64

00:09:55

passed #592520
linux amd64
system:gcc:bionic:amd64

00:09:09

passed #592776
linux amd64
system:gcc:bionic:amd64

00:09:48

passed #592358
amd64 linux
system:gcc:buster:amd64

00:10:03

passed #592751
amd64 linux
system:gcc:buster:amd64

00:10:52

passed #592777
linux amd64
system:gcc:buster:amd64

00:11:20

passed #592517
linux amd64
system:gcc:buster:amd64

00:11:00

passed #592492
amd64 linux
system:gcc:buster:amd64

00:11:31

passed #592885
amd64 linux
system:gcc:buster:amd64

00:11:43

passed #592903
linux amd64
system:gcc:buster:amd64

00:11:19

passed #592926
amd64 linux
system:gcc:buster:amd64

00:09:58

passed #592392
linux amd64
system:gcc:buster:amd64

00:10:07

passed #592921
amd64 linux
system:gcc:centos6:amd64

00:09:57

passed #592902
linux amd64
system:gcc:centos6:amd64

00:10:58

passed #592884
amd64 linux
system:gcc:centos6:amd64

00:11:08

passed #592778
linux amd64
system:gcc:centos6:amd64

00:09:41

failed #592353
amd64 linux
system:gcc:centos6:amd64

00:09:57

passed #592753
amd64 linux
system:gcc:centos6:amd64

00:10:17

passed #592391
linux amd64
system:gcc:centos6:amd64

00:10:04

passed #592490
amd64 linux
system:gcc:centos6:amd64

00:10:34

passed #592516
linux amd64
system:gcc:centos6:amd64

00:10:31

passed #592390
linux amd64
system:gcc:centos7:amd64

00:10:03

passed #592883
amd64 linux
system:gcc:centos7:amd64

00:10:02

passed #592354
amd64 linux
system:gcc:centos7:amd64

00:10:28

passed #592901
linux amd64
system:gcc:centos7:amd64

00:10:05

passed #592754
amd64 linux
system:gcc:centos7:amd64

00:11:11

passed #592920
amd64 linux
system:gcc:centos7:amd64

00:10:26

passed #592779
linux amd64
system:gcc:centos7:amd64

00:10:22

passed #592515
linux amd64
system:gcc:centos7:amd64

00:10:18

passed #592491
amd64 linux
system:gcc:centos7:amd64

00:10:30

passed #592355
amd64 linux
system:gcc:centos8:amd64

00:10:57

passed #592755
amd64 linux
system:gcc:centos8:amd64

00:10:50

passed #592514
linux amd64
system:gcc:centos8:amd64

00:10:28

passed #592919
amd64 linux
system:gcc:centos8:amd64

00:09:53

passed #592882
amd64 linux
system:gcc:centos8:amd64

00:11:44

passed #592489
amd64 linux
system:gcc:centos8:amd64

00:12:18

passed #592900
linux amd64
system:gcc:centos8:amd64

00:10:23

passed #592780
linux amd64
system:gcc:centos8:amd64

00:10:02

passed #592389
linux amd64
system:gcc:centos8:amd64

00:11:21

passed #592513
linux amd64
system:gcc:fedora31:amd64

00:11:25

passed #592918
amd64 linux
system:gcc:fedora31:amd64

00:10:38

passed #592899
linux amd64
system:gcc:fedora31:amd64

00:10:54

passed #592881
amd64 linux
system:gcc:fedora31:amd64

00:11:52

passed #592781
linux amd64
system:gcc:fedora31:amd64

00:10:34

passed #592756
amd64 linux
system:gcc:fedora31:amd64

00:11:23

passed #592488
amd64 linux
system:gcc:fedora31:amd64

00:12:37

passed #592388
linux amd64
system:gcc:fedora31:amd64

00:11:06

passed #592362
amd64 linux
system:gcc:fedora31:amd64

00:10:59

passed #592880
amd64 linux
system:gcc:jessie:amd64

00:10:23

passed #592387
linux amd64
system:gcc:jessie:amd64

00:09:58

passed #592782
linux amd64
system:gcc:jessie:amd64

00:10:20

passed #592917
amd64 linux
system:gcc:jessie:amd64

00:09:29

passed #592512
linux amd64
system:gcc:jessie:amd64

00:10:19

passed #592487
amd64 linux
system:gcc:jessie:amd64

00:10:35

passed #592356
amd64 linux
system:gcc:jessie:amd64

00:10:03

passed #592757
amd64 linux
system:gcc:jessie:amd64

00:10:13

passed #592898
linux amd64
system:gcc:jessie:amd64

00:10:02

passed #592758
amd64 linux
system:gcc:sid:amd64

00:10:56

passed #592879
amd64 linux
system:gcc:sid:amd64

00:11:54

passed #592359
amd64 linux
system:gcc:sid:amd64

00:10:33

passed #592386
linux amd64
system:gcc:sid:amd64

00:10:46

passed #592916
amd64 linux
system:gcc:sid:amd64

00:10:33

passed #592511
linux amd64
system:gcc:sid:amd64

00:11:30

passed #592897
linux amd64
system:gcc:sid:amd64

00:11:03

passed #592783
linux amd64
system:gcc:sid:amd64

00:11:18

passed #592486
amd64 linux
system:gcc:sid:amd64

00:12:33

passed #592485
i386 linux
system:gcc:sid:i386

00:11:45

passed #592915
i386 linux
system:gcc:sid:i386

00:11:28

passed #592784
linux i386
system:gcc:sid:i386

00:11:52

passed #592878
i386 linux
system:gcc:sid:i386

00:11:28

passed #592360
i386 linux
system:gcc:sid:i386

00:11:30

passed #592510
linux i386
system:gcc:sid:i386

00:11:10

passed #592896
linux i386
system:gcc:sid:i386

00:10:27

passed #592759
i386 linux
system:gcc:sid:i386

00:11:18

passed #592385
linux i386
system:gcc:sid:i386

00:11:29

passed #592760
amd64 linux
system:gcc:stretch:amd64

00:10:04

passed #592509
linux amd64
system:gcc:stretch:amd64

00:09:45

passed #592785
linux amd64
system:gcc:stretch:amd64

00:10:53

passed #592877
amd64 linux
system:gcc:stretch:amd64

00:10:05

passed #592484
amd64 linux
system:gcc:stretch:amd64

00:10:28

passed #592895
linux amd64
system:gcc:stretch:amd64

00:10:17

passed #592914
amd64 linux
system:gcc:stretch:amd64

00:09:18

passed #592384
linux amd64
system:gcc:stretch:amd64

00:09:06

passed #592357
amd64 linux
system:gcc:stretch:amd64

00:11:03

passed #592876
amd64 linux
system:gcc:tumbleweed:amd64

00:10:33

passed #592361
amd64 linux
system:gcc:tumbleweed:amd64

00:11:11

passed #592483
amd64 linux
system:gcc:tumbleweed:amd64

00:11:52

passed #592894
linux amd64
system:gcc:tumbleweed:amd64

00:10:53

passed #592786
linux amd64
system:gcc:tumbleweed:amd64

00:11:04

passed #592508
linux amd64
system:gcc:tumbleweed:amd64

00:10:35

passed #592383
linux amd64
system:gcc:tumbleweed:amd64

00:10:23

passed #592913
amd64 linux
system:gcc:tumbleweed:amd64

00:10:02

passed #592761
amd64 linux
system:gcc:tumbleweed:amd64

00:11:15

passed #592893
linux amd64
system:gcc:xenial:amd64

00:09:25

passed #592787
linux amd64
system:gcc:xenial:amd64

00:09:24

passed #592507
linux amd64
system:gcc:xenial:amd64

00:09:36

passed #592762
amd64 linux
system:gcc:xenial:amd64

00:09:25

passed #592381
linux amd64
system:gcc:xenial:amd64

00:09:18

passed #592363
amd64 linux
system:gcc:xenial:amd64

00:10:05

passed #592912
amd64 linux
system:gcc:xenial:amd64

00:09:16

passed #592482
amd64 linux
system:gcc:xenial:amd64

00:10:33

passed #592875
amd64 linux
system:gcc:xenial:amd64

00:10:38

passed #592506
linux amd64
system:nolibtool:sid:amd64

00:12:01

passed #592892
linux amd64
system:nolibtool:sid:amd64

00:11:57

passed #592380
linux amd64
system:nolibtool:sid:amd64

00:12:22

passed #592481
amd64 linux
system:nolibtool:sid:amd64

00:12:27

passed #592911
amd64 linux
system:nolibtool:sid:amd64

00:11:55

passed #592788
linux amd64
system:nolibtool:sid:amd64

00:12:12

passed #592763
amd64 linux
system:nolibtool:sid:amd64

00:11:55

passed #592874
amd64 linux
system:nolibtool:sid:amd64

00:11:34

passed #592371
amd64 linux
system:nolibtool:sid:amd64

00:11:19

passed #592789
linux amd64
system:pkcs11:sid:amd64

00:11:12

passed #592505
linux amd64
system:pkcs11:sid:amd64

00:11:01

passed #592480
amd64 linux
system:pkcs11:sid:amd64

00:11:57

passed #592368
amd64 linux
system:pkcs11:sid:amd64

00:11:08

passed #592891
linux amd64
system:pkcs11:sid:amd64

00:11:00

passed #592382
linux amd64
system:pkcs11:sid:amd64

00:11:53

passed #592873
amd64 linux
system:pkcs11:sid:amd64

00:10:38

passed #592910
amd64 linux
system:pkcs11:sid:amd64

00:09:44

passed #592764
amd64 linux
system:pkcs11:sid:amd64

00:11:13

passed #592379
linux amd64
system:rwlock:sid:amd64

00:11:54

passed #592909
linux amd64
system:rwlock:sid:amd64

00:10:40

failed #592792
linux amd64
system:rwlock:sid:amd64

00:12:13

passed #592367
amd64 linux
system:rwlock:sid:amd64

00:11:26

passed #592504
linux amd64
system:rwlock:sid:amd64

00:11:00

passed #592765
amd64 linux
system:rwlock:sid:amd64

00:11:00

passed #592479
amd64 linux
system:rwlock:sid:amd64

00:11:34

passed #592890
amd64 linux
system:rwlock:sid:amd64

00:10:24

failed #592366
amd64 linux allowed to fail
system:tsan:buster:amd64

00:15:26

 
  Docs
passed #592372
amd64 linux
docs:sid:amd64

00:01:15

 
  Postcheck
passed #592374
amd64 linux
cppcheck:gcc:sid:amd64

00:01:52

passed #592373
amd64 linux
scan-build:buster:amd64

00:10:38

 
Name Stage Failure
failed
system:gcc:alpine3.11:amd64 System
I:      1 FAIL
I: 98 PASS
I:The following system tests failed:
I: dnstap
make: *** [Makefile:486: test] Error 1
Uploading artifacts...
untracked: found 1388 files
Uploading artifacts to coordinator... ok
id=592930 responseStatus=201 Created token=isJZ2SNC
ERROR: Job failed: exit code 1
failed
system:clang:freebsd12.0:amd64 System
I:      padding
*** [test] Error code 1

make: stopped in /builds/isc-projects/bind9/bin/tests/system
Uploading artifacts...
Runtime platform arch=amd64 os=freebsd pid=37982 revision=de7731dd version=12.1.0
untracked: found 1359 files

Uploading artifacts to coordinator... ok
id=592929 responseStatus=201 Created token=xdxcdmsC
ERROR: Job failed: exit status 1
failed
system:clang:freebsd11.3:amd64 System
I:      padding
*** [test] Error code 1

make: stopped in /builds/isc-projects/bind9/bin/tests/system
Uploading artifacts...
Runtime platform arch=amd64 os=freebsd pid=35763 revision=de7731dd version=12.1.0
untracked: found 1348 files

Uploading artifacts to coordinator... ok
id=592928 responseStatus=201 Created token=55oDyjqM
ERROR: Job failed: exit status 1
failed
system:tsan:buster:amd64 System
make: *** [Makefile:486: test] Error 1
Running after script...
$ find bin -name 'tsan.*' -exec python3 util/parse_tsan.py {} \;
Uploading artifacts...
bin/tests/system/*/tsan.*: found 18 matching files
bin/tests/system/*/*/tsan.*: found 269 matching files

tsan/: found 228 matching files

Uploading artifacts to coordinator... ok
id=592766 responseStatus=201 Created token=yP1qmhd5
ERROR: Job failed: exit code 1
failed
unit:tsan:buster:amd64 Unit
$ find lib -name 'tsan.*' -exec python3 util/parse_tsan.py {} \;
Uploading artifacts...
WARNING: lib/*/tests/tsan.*: no matching files
WARNING: tsan/: no matching files
kyua.log: found 1 matching files

kyua.results: found 1 matching files

WARNING: kyua_html/: no matching files
Uploading artifacts to coordinator... ok
id=592345 responseStatus=201 Created token=XbHYbi1f
ERROR: Job failed: exit code 1