Add arm64 to GitLab CI

79 jobs for !3038 with ondrej/add-arm64-to-CI in 50 minutes and 7 seconds (queued for 28 seconds)
detached
Status Job ID Name Coverage
  Precheck
passed #663512
amd64 linux
🐞:sid:amd64

00:04:04

passed #663510
amd64 linux
autoreconf:sid:amd64

00:00:21

passed #663511
amd64 linux
misc:sid:amd64

00:00:18

 
  Build
passed #663528
amd64 linux
asan:sid:amd64

00:01:22

passed #663535
amd64 freebsd
clang:freebsd11.3:amd64

00:01:12

passed #663536
amd64 freebsd
clang:freebsd12.0:amd64

00:01:05

passed #663537
amd64 libvirt
clang:openbsd6.6:amd64

00:07:39

passed #663532
amd64 linux
clang:stretch:amd64

00:01:40

passed #663533
i386 linux
clang:stretch:i386

00:01:39

passed #663513
amd64 linux
gcc:alpine3.11:amd64

00:02:27

passed #663527
amd64 linux
gcc:bionic:amd64

00:01:26

passed #663519
amd64 linux
gcc:buster:amd64

00:01:27

passed #663514
amd64 linux
gcc:centos6:amd64

00:01:52

passed #663515
amd64 linux
gcc:centos7:amd64

00:02:47

passed #663516
amd64 linux
gcc:centos8:amd64

00:02:57

passed #663525
amd64 linux
gcc:fedora31:amd64

00:02:00

passed #663517
amd64 linux
gcc:jessie:amd64

00:00:58

passed #663520
amd64 linux
gcc:sid:amd64

00:02:45

passed #663522
arm64 linux
gcc:sid:arm64

00:09:26

passed #663523
i386 linux
gcc:sid:i386

00:01:05

passed #663518
amd64 linux
gcc:stretch:amd64

00:01:46

passed #663524
amd64 linux
gcc:tumbleweed:amd64

00:02:24

passed #663526
amd64 linux
gcc:xenial:amd64

00:00:59

passed #663539
amd64 windows
msvc:windows:amd64

00:02:17

passed #663531
amd64 linux
mutexatomics:sid:amd64

00:01:21

passed #663538
amd64 linux
nolibtool:sid:amd64

00:01:50

passed #663521
amd64 linux
oot:sid:amd64

00:01:34

passed #663534
amd64 linux
pkcs11:sid:amd64

00:01:22

passed #663530
amd64 linux
rwlock:sid:amd64

00:01:27

passed #663529
amd64 linux
tsan:buster:amd64

00:02:49

 
  Unit
passed #663554
amd64 linux
unit:asan:sid:amd64

00:01:07

passed #663560
amd64 freebsd
unit:clang:freebsd11.3:amd64

00:00:34

passed #663561
amd64 freebsd
unit:clang:freebsd12.0:amd64

00:00:31

passed #663558
amd64 linux
unit:clang:stretch:amd64

00:00:52

passed #663540
amd64 linux
unit:gcc:alpine3.11:amd64

00:00:55

passed #663553
amd64 linux
unit:gcc:bionic:amd64

00:00:54

passed #663546
amd64 linux
unit:gcc:buster:amd64

00:01:03

passed #663541
amd64 linux
unit:gcc:centos6:amd64

00:00:56

passed #663542
amd64 linux
unit:gcc:centos7:amd64

00:00:53

passed #663543
amd64 linux
unit:gcc:centos8:amd64

00:00:52

passed #663551
amd64 linux
unit:gcc:fedora31:amd64

00:01:06

passed #663544
amd64 linux
unit:gcc:jessie:amd64

00:00:29

passed #663547
amd64 linux
unit:gcc:sid:amd64

00:00:41

passed #663548
arm64 linux
unit:gcc:sid:arm64

00:01:05

passed #663549
i386 linux
unit:gcc:sid:i386

00:00:54

passed #663545
amd64 linux
unit:gcc:stretch:amd64

00:00:42

passed #663550
amd64 linux
unit:gcc:tumbleweed:amd64

00:00:55

passed #663552
amd64 linux
unit:gcc:xenial:amd64

00:00:57

failed #663557
amd64 linux allowed to fail
unit:mutexatomics:sid:amd64

00:10:28

passed #663562
amd64 linux
unit:nolibtool:sid:amd64

00:01:16

passed #663559
amd64 linux
unit:pkcs11:sid:amd64

00:00:54

passed #663556
amd64 linux
unit:rwlock:sid:amd64

00:00:51

failed #663555
amd64 linux allowed to fail
unit:tsan:buster:amd64

00:02:36

 
  System
passed #663577
amd64 linux
system:asan:sid:amd64

00:14:19

passed #663582
amd64 freebsd
system:clang:freebsd11.3:amd64

00:12:34

passed #663583
amd64 freebsd
system:clang:freebsd12.0:amd64

00:12:38

passed #663563
amd64 linux
system:gcc:alpine3.11:amd64

00:12:47

passed #663576
amd64 linux
system:gcc:bionic:amd64

00:10:54

passed #663569
amd64 linux
system:gcc:buster:amd64

00:11:50

passed #663564
amd64 linux
system:gcc:centos6:amd64

00:12:21

passed #663565
amd64 linux
system:gcc:centos7:amd64

00:11:56

passed #663566
amd64 linux
system:gcc:centos8:amd64

00:12:30

passed #663574
amd64 linux
system:gcc:fedora31:amd64

00:12:10

failed #663567
amd64 linux
system:gcc:jessie:amd64

00:12:28

passed #663570
amd64 linux
system:gcc:sid:amd64

00:12:01

failed #663571
arm64 linux
system:gcc:sid:arm64

00:39:38

passed #663572
i386 linux
system:gcc:sid:i386

00:12:32

passed #663568
amd64 linux
system:gcc:stretch:amd64

00:11:39

passed #663573
amd64 linux
system:gcc:tumbleweed:amd64

00:12:13

passed #663575
amd64 linux
system:gcc:xenial:amd64

00:11:05

passed #663580
amd64 linux
system:mutexatomics:sid:amd64

00:12:27

passed #663584
amd64 linux
system:nolibtool:sid:amd64

00:13:44

passed #663581
amd64 linux
system:pkcs11:sid:amd64

00:12:42

passed #663579
amd64 linux
system:rwlock:sid:amd64

00:13:16

failed #663578
amd64 linux allowed to fail
system:tsan:buster:amd64

00:17:36

 
  Docs
passed #663585
amd64 linux
docs:sid:amd64

00:01:02

 
  Postcheck
passed #663587
amd64 linux
cppcheck:gcc:sid:amd64

00:02:00

passed #663588
arm64 linux
cppcheck:gcc:sid:arm64

00:04:00

passed #663586
amd64 linux
scan-build:buster:amd64

00:11:09

 
Name Stage Failure
failed
system:gcc:sid:arm64 System
I:      dnssec
I: dsdigest
I: nsupdate
I: verify
make: *** [Makefile:486: test] Error 1
Uploading artifacts...
untracked: found 2529 files
Uploading artifacts to coordinator... ok
id=663571 responseStatus=201 Created token=G7Ydg72J
ERROR: Job failed: exit code 1
failed
system:tsan:buster:amd64 System
make: *** [Makefile:486: test] Error 1
Running after script...
$ find bin -name 'tsan.*' -exec python3 util/parse_tsan.py {} \;
Uploading artifacts...
bin/tests/system/*/tsan.*: found 18 matching files
bin/tests/system/*/*/tsan.*: found 269 matching files

tsan/: found 196 matching files

Uploading artifacts to coordinator... ok
id=663578 responseStatus=201 Created token=bhYHqgfD
ERROR: Job failed: exit code 1
failed
system:gcc:jessie:amd64 System
I:      2 SKIPPED
I:The following system tests failed:
I: dnssec
make: *** [test] Error 1
Makefile:484: recipe for target 'test' failed
Uploading artifacts...
untracked: found 2169 files
Uploading artifacts to coordinator... ok
id=663567 responseStatus=201 Created token=C7cVKuNN
ERROR: Job failed: exit code 1
failed
unit:mutexatomics:sid:amd64 Unit
Generating kyua_html/lib_ns_tests_query_test_main.html
Generating kyua_html/report.css
Generating kyua_html/index.html
Uploading artifacts...
kyua.log: found 1 matching files
kyua.results: found 1 matching files

kyua_html/: found 70 matching files

Uploading artifacts to coordinator... ok
id=663557 responseStatus=201 Created token=uipLfzBt
ERROR: Job failed: exit code 1
failed
unit:tsan:buster:amd64 Unit
$ find lib -name 'tsan.*' -exec python3 util/parse_tsan.py {} \;
Uploading artifacts...
lib/*/tests/tsan.*: found 1 matching files
tsan/: found 6 matching files

kyua.log: found 1 matching files

kyua.results: found 1 matching files

WARNING: kyua_html/: no matching files
Uploading artifacts to coordinator... ok
id=663555 responseStatus=201 Created token=fidwfjLX
ERROR: Job failed: exit code 1