extend add-new tests

Status Job ID Name Coverage
  Precheck
passed #671289
amd64 linux
🐞:sid:amd64

00:03:52

passed #671287
amd64 linux
autoreconf:sid:amd64

00:00:32

passed #671288
amd64 linux
misc:sid:amd64

00:00:16

 
  Build
passed #671304
amd64 linux
asan:sid:amd64

00:02:34

passed #671311
amd64 freebsd
clang:freebsd11.3:amd64

00:01:07

passed #671312
amd64 freebsd
clang:freebsd12.0:amd64

00:00:58

passed #671313
amd64 libvirt
clang:openbsd6.6:amd64

00:08:28

passed #671308
amd64 linux
clang:stretch:amd64

00:02:24

passed #671309
i386 linux
clang:stretch:i386

00:01:28

passed #671290
amd64 linux
gcc:alpine3.11:amd64

00:02:39

passed #671303
amd64 linux
gcc:bionic:amd64

00:01:04

passed #671296
amd64 linux
gcc:buster:amd64

00:01:47

passed #671291
amd64 linux
gcc:centos6:amd64

00:02:25

passed #671292
amd64 linux
gcc:centos7:amd64

00:02:23

passed #671293
amd64 linux
gcc:centos8:amd64

00:02:44

passed #671301
amd64 linux
gcc:fedora31:amd64

00:02:41

passed #671294
amd64 linux
gcc:jessie:amd64

00:01:45

passed #671297
amd64 linux
gcc:sid:amd64

00:03:04

passed #671299
i386 linux
gcc:sid:i386

00:01:37

passed #671295
amd64 linux
gcc:stretch:amd64

00:02:00

passed #671300
amd64 linux
gcc:tumbleweed:amd64

00:02:28

passed #671302
amd64 linux
gcc:xenial:amd64

00:02:13

passed #671315
amd64 windows
msvc:windows:amd64

00:02:02

passed #671307
amd64 linux
mutexatomics:sid:amd64

00:01:06

passed #671314
amd64 linux
nolibtool:sid:amd64

00:02:44

passed #671298
amd64 linux
oot:sid:amd64

00:01:43

passed #671310
amd64 linux
pkcs11:sid:amd64

00:01:05

passed #671306
amd64 linux
rwlock:sid:amd64

00:01:25

passed #671305
amd64 linux
tsan:buster:amd64

00:03:07

 
  Unit
passed #671329
amd64 linux
unit:asan:sid:amd64

00:01:11

passed #671335
amd64 freebsd
unit:clang:freebsd11.3:amd64

00:00:34

passed #671336
amd64 freebsd
unit:clang:freebsd12.0:amd64

00:00:33

passed #671333
amd64 linux
unit:clang:stretch:amd64

00:00:53

passed #671316
amd64 linux
unit:gcc:alpine3.11:amd64

00:01:06

passed #671328
amd64 linux
unit:gcc:bionic:amd64

00:00:37

passed #671322
amd64 linux
unit:gcc:buster:amd64

00:00:54

passed #671317
amd64 linux
unit:gcc:centos6:amd64

00:00:41

passed #671318
amd64 linux
unit:gcc:centos7:amd64

00:01:06

passed #671319
amd64 linux
unit:gcc:centos8:amd64

00:00:58

passed #671326
amd64 linux
unit:gcc:fedora31:amd64

00:00:57

passed #671320
amd64 linux
unit:gcc:jessie:amd64

00:00:29

passed #671323
amd64 linux
unit:gcc:sid:amd64

00:00:41

passed #671324
i386 linux
unit:gcc:sid:i386

00:00:59

passed #671321
amd64 linux
unit:gcc:stretch:amd64

00:00:39

passed #671325
amd64 linux
unit:gcc:tumbleweed:amd64

00:00:53

passed #671327
amd64 linux
unit:gcc:xenial:amd64

00:00:41

failed #671332
amd64 linux allowed to fail
unit:mutexatomics:sid:amd64

00:10:53

passed #671337
amd64 linux
unit:nolibtool:sid:amd64

00:01:18

passed #671334
amd64 linux
unit:pkcs11:sid:amd64

00:00:53

passed #671331
amd64 linux
unit:rwlock:sid:amd64

00:00:54

failed #671330
amd64 linux allowed to fail
unit:tsan:buster:amd64

00:02:57

 
  System
passed #671351
amd64 linux
system:asan:sid:amd64

00:15:30

passed #671356
amd64 freebsd
system:clang:freebsd11.3:amd64

00:12:46

passed #671357
amd64 freebsd
system:clang:freebsd12.0:amd64

00:12:48

passed #671338
amd64 linux
system:gcc:alpine3.11:amd64

00:13:26

passed #671350
amd64 linux
system:gcc:bionic:amd64

00:12:11

passed #671344
amd64 linux
system:gcc:buster:amd64

00:12:35

failed #671339
amd64 linux
system:gcc:centos6:amd64

00:12:11

passed #671340
amd64 linux
system:gcc:centos7:amd64

00:12:44

passed #671341
amd64 linux
system:gcc:centos8:amd64

00:12:55

passed #671348
amd64 linux
system:gcc:fedora31:amd64

00:12:00

failed #671342
amd64 linux
system:gcc:jessie:amd64

00:12:17

passed #671345
amd64 linux
system:gcc:sid:amd64

00:12:19

passed #671346
i386 linux
system:gcc:sid:i386

00:12:44

passed #671343
amd64 linux
system:gcc:stretch:amd64

00:12:19

passed #671347
amd64 linux
system:gcc:tumbleweed:amd64

00:13:52

passed #671349
amd64 linux
system:gcc:xenial:amd64

00:10:59

passed #671354
amd64 linux
system:mutexatomics:sid:amd64

00:12:01

passed #671358
amd64 linux
system:nolibtool:sid:amd64

00:13:39

passed #671355
amd64 linux
system:pkcs11:sid:amd64

00:11:57

passed #671353
amd64 linux
system:rwlock:sid:amd64

00:12:50

failed #671352
amd64 linux allowed to fail
system:tsan:buster:amd64

00:16:59

 
  Docs
passed #671359
amd64 linux
docs:sid:amd64

00:00:36

 
  Postcheck
passed #671361
amd64 linux
cppcheck:gcc:sid:amd64

00:02:32

passed #671360
amd64 linux
scan-build:buster:amd64

00:11:37

 
Name Stage Failure
failed
system:tsan:buster:amd64 System
make: *** [Makefile:486: test] Error 1
Running after script...
$ find bin -name 'tsan.*' -exec python3 util/parse_tsan.py {} \;
Uploading artifacts...
bin/tests/system/*/tsan.*: found 18 matching files
bin/tests/system/*/*/tsan.*: found 269 matching files

tsan/: found 193 matching files

Uploading artifacts to coordinator... ok
id=671352 responseStatus=201 Created token=RoWEHg-d
ERROR: Job failed: exit code 1
failed
system:gcc:centos6:amd64 System
I:     96 PASS
I: 1 SKIPPED
I:The following system tests failed:
I: statistics
make: *** [test] Error 1
Uploading artifacts...
untracked: found 1365 files
Uploading artifacts to coordinator... ok
id=671339 responseStatus=201 Created token=evtyBm8W
ERROR: Job failed: exit code 1
failed
system:gcc:jessie:amd64 System
I:      2 SKIPPED
I:The following system tests failed:
I: fetchlimit
Makefile:484: recipe for target 'test' failed
make: *** [test] Error 1
Uploading artifacts...
untracked: found 1085 files
Uploading artifacts to coordinator... ok
id=671342 responseStatus=201 Created token=MAbTx3gn
ERROR: Job failed: exit code 1
failed
unit:mutexatomics:sid:amd64 Unit
Generating kyua_html/lib_ns_tests_query_test_main.html
Generating kyua_html/report.css
Generating kyua_html/index.html
Uploading artifacts...
kyua.log: found 1 matching files
kyua.results: found 1 matching files

kyua_html/: found 69 matching files

Uploading artifacts to coordinator... ok
id=671332 responseStatus=201 Created token=EsxBsHYL
ERROR: Job failed: exit code 1
failed
unit:tsan:buster:amd64 Unit
$ find lib -name 'tsan.*' -exec python3 util/parse_tsan.py {} \;
Uploading artifacts...
WARNING: lib/*/tests/tsan.*: no matching files
WARNING: tsan/: no matching files
kyua.log: found 1 matching files

kyua.results: found 1 matching files

WARNING: kyua_html/: no matching files
Uploading artifacts to coordinator... ok
id=671330 responseStatus=201 Created token=WoSqiWfz
ERROR: Job failed: exit code 1