error out if gen finds a type oclass that is greater than 65535

Status Job ID Name Coverage
  Precheck
passed #671364
amd64 linux
🐞:sid:amd64

00:04:06

passed #671362
amd64 linux
autoreconf:sid:amd64

00:00:20

passed #671363
amd64 linux
misc:sid:amd64

00:00:23

 
  Build
passed #671379
amd64 linux
asan:sid:amd64

00:01:38

passed #671386
amd64 freebsd
clang:freebsd11.3:amd64

00:01:18

passed #671387
amd64 freebsd
clang:freebsd12.0:amd64

00:01:08

passed #671388
amd64 libvirt
clang:openbsd6.6:amd64

00:08:05

passed #671383
amd64 linux
clang:stretch:amd64

00:01:35

passed #671384
i386 linux
clang:stretch:i386

00:01:33

passed #671365
amd64 linux
gcc:alpine3.11:amd64

00:02:26

passed #671378
amd64 linux
gcc:bionic:amd64

00:01:24

passed #671371
amd64 linux
gcc:buster:amd64

00:00:55

passed #671366
amd64 linux
gcc:centos6:amd64

00:02:53

passed #671367
amd64 linux
gcc:centos7:amd64

00:02:57

passed #671368
amd64 linux
gcc:centos8:amd64

00:02:18

passed #671376
amd64 linux
gcc:fedora31:amd64

00:02:07

passed #671369
amd64 linux
gcc:jessie:amd64

00:01:21

passed #671372
amd64 linux
gcc:sid:amd64

00:02:24

passed #671374
i386 linux
gcc:sid:i386

00:00:57

passed #671370
amd64 linux
gcc:stretch:amd64

00:02:20

passed #671375
amd64 linux
gcc:tumbleweed:amd64

00:02:10

passed #671377
amd64 linux
gcc:xenial:amd64

00:00:52

passed #671390
amd64 windows
msvc:windows:amd64

00:02:19

passed #671382
amd64 linux
mutexatomics:sid:amd64

00:01:26

passed #671389
amd64 linux
nolibtool:sid:amd64

00:01:35

passed #671373
amd64 linux
oot:sid:amd64

00:01:31

passed #671385
amd64 linux
pkcs11:sid:amd64

00:01:43

passed #671381
amd64 linux
rwlock:sid:amd64

00:01:29

passed #671380
amd64 linux
tsan:buster:amd64

00:03:08

 
  Unit
passed #671404
amd64 linux
unit:asan:sid:amd64

00:01:10

passed #671410
amd64 freebsd
unit:clang:freebsd11.3:amd64

00:00:35

failed #671411
amd64 freebsd
unit:clang:freebsd12.0:amd64

00:05:12

passed #671408
amd64 linux
unit:clang:stretch:amd64

00:00:56

passed #671391
amd64 linux
unit:gcc:alpine3.11:amd64

00:00:55

passed #671403
amd64 linux
unit:gcc:bionic:amd64

00:00:53

passed #671397
amd64 linux
unit:gcc:buster:amd64

00:00:55

passed #671392
amd64 linux
unit:gcc:centos6:amd64

00:00:56

passed #671393
amd64 linux
unit:gcc:centos7:amd64

00:00:52

passed #671394
amd64 linux
unit:gcc:centos8:amd64

00:00:53

passed #671401
amd64 linux
unit:gcc:fedora31:amd64

00:00:54

passed #671395
amd64 linux
unit:gcc:jessie:amd64

00:00:29

passed #671398
amd64 linux
unit:gcc:sid:amd64

00:00:54

passed #671399
i386 linux
unit:gcc:sid:i386

00:01:04

passed #671396
amd64 linux
unit:gcc:stretch:amd64

00:00:52

passed #671400
amd64 linux
unit:gcc:tumbleweed:amd64

00:00:54

passed #671402
amd64 linux
unit:gcc:xenial:amd64

00:00:46

failed #671407
amd64 linux allowed to fail
unit:mutexatomics:sid:amd64

00:10:50

passed #671412
amd64 linux
unit:nolibtool:sid:amd64

00:01:53

passed #671409
amd64 linux
unit:pkcs11:sid:amd64

00:00:54

passed #671406
amd64 linux
unit:rwlock:sid:amd64

00:00:59

failed #671405
amd64 linux allowed to fail
unit:tsan:buster:amd64

00:02:57

 
  System
failed #671426
amd64 linux
system:asan:sid:amd64

00:14:06

passed #671431
amd64 freebsd
system:clang:freebsd11.3:amd64

00:12:50

passed #671432
amd64 freebsd
system:clang:freebsd12.0:amd64

00:12:45

passed #671413
amd64 linux
system:gcc:alpine3.11:amd64

00:13:32

passed #671425
amd64 linux
system:gcc:bionic:amd64

00:10:22

passed #671419
amd64 linux
system:gcc:buster:amd64

00:10:50

passed #671414
amd64 linux
system:gcc:centos6:amd64

00:11:44

passed #671415
amd64 linux
system:gcc:centos7:amd64

00:12:39

passed #671416
amd64 linux
system:gcc:centos8:amd64

00:11:58

passed #671423
amd64 linux
system:gcc:fedora31:amd64

00:11:54

passed #671417
amd64 linux
system:gcc:jessie:amd64

00:11:51

passed #671420
amd64 linux
system:gcc:sid:amd64

00:11:33

passed #671421
i386 linux
system:gcc:sid:i386

00:12:01

passed #671418
amd64 linux
system:gcc:stretch:amd64

00:10:55

passed #671422
amd64 linux
system:gcc:tumbleweed:amd64

00:11:58

passed #671424
amd64 linux
system:gcc:xenial:amd64

00:12:01

passed #671429
amd64 linux
system:mutexatomics:sid:amd64

00:12:00

passed #671433
amd64 linux
system:nolibtool:sid:amd64

00:12:33

failed #671430
amd64 linux
system:pkcs11:sid:amd64

00:12:20

passed #671428
amd64 linux
system:rwlock:sid:amd64

00:12:05

failed #671427
amd64 linux allowed to fail
system:tsan:buster:amd64

00:16:24

 
  Docs
passed #671434
amd64 linux
docs:sid:amd64

00:00:32

 
  Postcheck
passed #671436
amd64 linux
cppcheck:gcc:sid:amd64

00:02:02

passed #671435
amd64 linux
scan-build:buster:amd64

00:10:09

 
Name Stage Failure
failed
system:tsan:buster:amd64 System
make: *** [Makefile:486: test] Error 1
Running after script...
$ find bin -name 'tsan.*' -exec python3 util/parse_tsan.py {} \;
Uploading artifacts...
bin/tests/system/*/tsan.*: found 18 matching files
bin/tests/system/*/*/tsan.*: found 270 matching files

tsan/: found 197 matching files

Uploading artifacts to coordinator... ok
id=671427 responseStatus=201 Created token=SF-qSqRT
ERROR: Job failed: exit code 1
failed
system:asan:sid:amd64 System
I:      1 FAIL
I: 97 PASS
I:The following system tests failed:
I: autosign
make: *** [Makefile:486: test] Error 1
Uploading artifacts...
untracked: found 1813 files
Uploading artifacts to coordinator... ok
id=671426 responseStatus=201 Created token=FQDXmBx2
ERROR: Job failed: exit code 1
failed
system:pkcs11:sid:amd64 System
I:The following system tests failed:
I: autosign
I:Core dumps were found for the following system tests:
I: autosign
make: *** [Makefile:486: test] Error 1
Uploading artifacts...
untracked: found 1850 files
Uploading artifacts to coordinator... ok
id=671430 responseStatus=201 Created token=yUT7gxeS
ERROR: Job failed: exit code 1
failed
unit:mutexatomics:sid:amd64 Unit
Generating kyua_html/lib_ns_tests_query_test_main.html
Generating kyua_html/report.css
Generating kyua_html/index.html
Uploading artifacts...
kyua.log: found 1 matching files
kyua.results: found 1 matching files

kyua_html/: found 69 matching files

Uploading artifacts to coordinator... ok
id=671407 responseStatus=201 Created token=3Msm3_se
ERROR: Job failed: exit code 1
failed
unit:tsan:buster:amd64 Unit
$ find lib -name 'tsan.*' -exec python3 util/parse_tsan.py {} \;
Uploading artifacts...
WARNING: lib/*/tests/tsan.*: no matching files
WARNING: tsan/: no matching files
kyua.log: found 1 matching files

kyua.results: found 1 matching files

WARNING: kyua_html/: no matching files
Uploading artifacts to coordinator... ok
id=671405 responseStatus=201 Created token=aKxtXKGz
ERROR: Job failed: exit code 1
failed
unit:clang:freebsd12.0:amd64 Unit
Generating kyua_html/report.css
Generating kyua_html/index.html
Uploading artifacts...
Runtime platform arch=amd64 os=freebsd pid=96528 revision=de7731dd version=12.1.0
kyua.log: found 1 matching files

kyua.results: found 1 matching files

kyua_html/: found 69 matching files

Uploading artifacts to coordinator... ok
id=671411 responseStatus=201 Created token=xKCr5Mqs
ERROR: Job failed: exit status 1