add CHANGES

75 jobs for !2178 with 1154-add-dns64-prefix-discover-support in 20 minutes and 8 seconds (queued for 6 seconds)
detached
Status Job ID Name Coverage
  Precheck
passed #675880
amd64 linux
🐞:sid:amd64

00:03:55

passed #675878
amd64 linux
autoreconf:sid:amd64

00:00:32

passed #675879
amd64 linux
misc:sid:amd64

00:00:16

 
  Build
passed #675895
amd64 linux
asan:sid:amd64

00:04:35

passed #675902
amd64 freebsd
clang:freebsd11.3:amd64

00:01:08

passed #675903
amd64 freebsd
clang:freebsd12.0:amd64

00:00:58

passed #675904
amd64 libvirt
clang:openbsd6.6:amd64

00:09:02

passed #675899
amd64 linux
clang:stretch:amd64

00:02:55

passed #675900
i386 linux
clang:stretch:i386

00:03:01

passed #675881
amd64 linux
gcc:alpine3.11:amd64

00:03:14

passed #675894
amd64 linux
gcc:bionic:amd64

00:02:34

passed #675887
amd64 linux
gcc:buster:amd64

00:02:24

passed #675882
amd64 linux
gcc:centos6:amd64

00:02:40

passed #675883
amd64 linux
gcc:centos7:amd64

00:02:15

passed #675884
amd64 linux
gcc:centos8:amd64

00:02:23

passed #675892
amd64 linux
gcc:fedora31:amd64

00:02:30

passed #675885
amd64 linux
gcc:jessie:amd64

00:02:27

passed #675888
amd64 linux
gcc:sid:amd64

00:04:14

passed #675890
i386 linux
gcc:sid:i386

00:02:31

passed #675886
amd64 linux
gcc:stretch:amd64

00:02:57

passed #675891
amd64 linux
gcc:tumbleweed:amd64

00:02:27

passed #675893
amd64 linux
gcc:xenial:amd64

00:02:40

passed #675906
amd64 windows
msvc:windows:amd64

00:02:16

passed #675898
amd64 linux
mutexatomics:sid:amd64

00:02:42

passed #675905
amd64 linux
nolibtool:sid:amd64

00:03:24

passed #675889
amd64 linux
oot:sid:amd64

00:03:19

passed #675901
amd64 linux
pkcs11:sid:amd64

00:02:42

passed #675897
amd64 linux
rwlock:sid:amd64

00:02:49

passed #675896
amd64 linux
tsan:buster:amd64

00:03:28

 
  Unit
passed #675920
amd64 linux
unit:asan:sid:amd64

00:00:57

passed #675926
amd64 freebsd
unit:clang:freebsd11.3:amd64

00:00:33

failed #675927
amd64 freebsd
unit:clang:freebsd12.0:amd64

00:05:14

passed #675924
amd64 linux
unit:clang:stretch:amd64

00:00:41

passed #675907
amd64 linux
unit:gcc:alpine3.11:amd64

00:00:59

passed #675919
amd64 linux
unit:gcc:bionic:amd64

00:00:44

passed #675913
amd64 linux
unit:gcc:buster:amd64

00:00:55

passed #675908
amd64 linux
unit:gcc:centos6:amd64

00:00:57

passed #675909
amd64 linux
unit:gcc:centos7:amd64

00:01:01

passed #675910
amd64 linux
unit:gcc:centos8:amd64

00:00:56

passed #675917
amd64 linux
unit:gcc:fedora31:amd64

00:00:56

passed #675911
amd64 linux
unit:gcc:jessie:amd64

00:00:31

passed #675914
amd64 linux
unit:gcc:sid:amd64

00:00:51

passed #675915
i386 linux
unit:gcc:sid:i386

00:00:43

passed #675912
amd64 linux
unit:gcc:stretch:amd64

00:00:56

passed #675916
amd64 linux
unit:gcc:tumbleweed:amd64

00:00:57

passed #675918
amd64 linux
unit:gcc:xenial:amd64

00:00:57

failed #675923
amd64 linux allowed to fail
unit:mutexatomics:sid:amd64

00:10:53

passed #675928
amd64 linux
unit:nolibtool:sid:amd64

00:01:58

passed #675925
amd64 linux
unit:pkcs11:sid:amd64

00:00:55

passed #675922
amd64 linux
unit:rwlock:sid:amd64

00:00:41

failed #675921
amd64 linux allowed to fail
unit:tsan:buster:amd64

00:01:49

 
  System
passed #675942
amd64 linux
system:asan:sid:amd64

00:13:32

passed #675947
amd64 freebsd
system:clang:freebsd11.3:amd64

00:12:41

failed #675948
amd64 freebsd
system:clang:freebsd12.0:amd64

00:12:40

passed #675929
amd64 linux
system:gcc:alpine3.11:amd64

00:12:52

failed #675941
amd64 linux
system:gcc:bionic:amd64

00:12:21

passed #675935
amd64 linux
system:gcc:buster:amd64

00:11:29

passed #675930
amd64 linux
system:gcc:centos6:amd64

00:11:45

passed #675931
amd64 linux
system:gcc:centos7:amd64

00:11:56

passed #675932
amd64 linux
system:gcc:centos8:amd64

00:12:29

passed #675939
amd64 linux
system:gcc:fedora31:amd64

00:11:36

passed #675933
amd64 linux
system:gcc:jessie:amd64

00:11:35

passed #675936
amd64 linux
system:gcc:sid:amd64

00:11:38

passed #675937
i386 linux
system:gcc:sid:i386

00:11:35

passed #675934
amd64 linux
system:gcc:stretch:amd64

00:11:03

passed #675938
amd64 linux
system:gcc:tumbleweed:amd64

00:11:42

passed #675940
amd64 linux
system:gcc:xenial:amd64

00:11:04

passed #675945
amd64 linux
system:mutexatomics:sid:amd64

00:12:15

passed #675949
amd64 linux
system:nolibtool:sid:amd64

00:12:34

passed #675946
amd64 linux
system:pkcs11:sid:amd64

00:11:40

passed #675944
amd64 linux
system:rwlock:sid:amd64

00:12:04

failed #675943
amd64 linux allowed to fail
system:tsan:buster:amd64

00:15:58

 
  Docs
passed #675950
amd64 linux
docs:sid:amd64

00:01:04

 
  Postcheck
passed #675952
amd64 linux
cppcheck:gcc:sid:amd64

00:03:54

passed #675951
amd64 linux
scan-build:buster:amd64

00:10:45

 
Name Stage Failure
failed
system:tsan:buster:amd64 System
make: *** [Makefile:486: test] Error 1
Running after script...
$ find bin -name 'tsan.*' -exec python3 util/parse_tsan.py {} \;
Uploading artifacts...
bin/tests/system/*/tsan.*: found 18 matching files
bin/tests/system/*/*/tsan.*: found 269 matching files

tsan/: found 186 matching files

Uploading artifacts to coordinator... ok
id=675943 responseStatus=201 Created token=c-YRgsWf
ERROR: Job failed: exit code 1
failed
system:gcc:bionic:amd64 System
I:     97 PASS
I:The following system tests failed:
I: dnssec
make: *** [test] Error 1
Makefile:484: recipe for target 'test' failed
Uploading artifacts...
untracked: found 2432 files
Uploading artifacts to coordinator... ok
id=675941 responseStatus=201 Created token=b5xDovcE
ERROR: Job failed: exit code 1
failed
system:clang:freebsd12.0:amd64 System
I:      rrl
*** [test] Error code 1

make: stopped in /builds/isc-projects/bind9/bin/tests/system
Uploading artifacts...
Runtime platform arch=amd64 os=freebsd pid=95971 revision=de7731dd version=12.1.0
untracked: found 1373 files

Uploading artifacts to coordinator... ok
id=675948 responseStatus=201 Created token=Hk2MEs2C
ERROR: Job failed: exit status 1
failed
unit:mutexatomics:sid:amd64 Unit
Generating kyua_html/lib_ns_tests_query_test_main.html
Generating kyua_html/report.css
Generating kyua_html/index.html
Uploading artifacts...
kyua.log: found 1 matching files
kyua.results: found 1 matching files

kyua_html/: found 69 matching files

Uploading artifacts to coordinator... ok
id=675923 responseStatus=201 Created token=E1Rc12ya
ERROR: Job failed: exit code 1
failed
unit:clang:freebsd12.0:amd64 Unit
Generating kyua_html/report.css
Generating kyua_html/index.html
Uploading artifacts...
Runtime platform arch=amd64 os=freebsd pid=26519 revision=de7731dd version=12.1.0
kyua.log: found 1 matching files

kyua.results: found 1 matching files

kyua_html/: found 69 matching files

Uploading artifacts to coordinator... ok
id=675927 responseStatus=201 Created token=zxxBxuPE
ERROR: Job failed: exit status 1
failed
unit:tsan:buster:amd64 Unit
$ find lib -name 'tsan.*' -exec python3 util/parse_tsan.py {} \;
Uploading artifacts...
WARNING: lib/*/tests/tsan.*: no matching files
WARNING: tsan/: no matching files
kyua.log: found 1 matching files

kyua.results: found 1 matching files

WARNING: kyua_html/: no matching files
Uploading artifacts to coordinator... ok
id=675921 responseStatus=201 Created token=rzFLrtzx
ERROR: Job failed: exit code 1