Add an arena to compressctx

76 jobs for !3068 with wpk/perfwork-4-compressctx-arena in 35 minutes and 34 seconds (queued for 9 minutes and 19 seconds)
detached
Status Job ID Name Coverage
  Precheck
passed #678441
amd64 linux
🐞:sid:amd64

00:05:07

passed #678440
amd64 linux
💾:sid:amd64

00:00:21

passed #678438
amd64 linux
autoreconf:sid:amd64

00:00:19

passed #678439
amd64 linux
misc:sid:amd64

00:00:19

 
  Build
passed #678456
amd64 linux
asan:sid:amd64

00:04:16

passed #678463
amd64 freebsd
clang:freebsd11.3:amd64

00:01:44

passed #678464
amd64 freebsd
clang:freebsd12.0:amd64

00:01:21

passed #678465
amd64 libvirt
clang:openbsd6.6:amd64

00:05:22

passed #678460
amd64 linux
clang:stretch:amd64

00:02:40

passed #678461
i386 linux
clang:stretch:i386

00:02:37

passed #678442
amd64 linux
gcc:alpine3.11:amd64

00:02:16

passed #678455
amd64 linux
gcc:bionic:amd64

00:02:10

passed #678448
amd64 linux
gcc:buster:amd64

00:02:10

passed #678443
amd64 linux
gcc:centos6:amd64

00:01:58

passed #678444
amd64 linux
gcc:centos7:amd64

00:03:45

passed #678445
amd64 linux
gcc:centos8:amd64

00:02:13

passed #678453
amd64 linux
gcc:fedora31:amd64

00:02:21

passed #678446
amd64 linux
gcc:jessie:amd64

00:03:04

passed #678449
amd64 linux
gcc:sid:amd64

00:03:43

passed #678451
i386 linux
gcc:sid:i386

00:02:34

passed #678447
amd64 linux
gcc:stretch:amd64

00:02:33

passed #678452
amd64 linux
gcc:tumbleweed:amd64

00:01:49

passed #678454
amd64 linux
gcc:xenial:amd64

00:02:33

passed #678467
amd64 windows
msvc:windows:amd64

00:02:22

passed #678459
amd64 linux
mutexatomics:sid:amd64

00:02:11

passed #678466
amd64 linux
nolibtool:sid:amd64

00:03:01

failed #678450
amd64 linux
oot:sid:amd64

00:01:27

passed #678462
amd64 linux
pkcs11:sid:amd64

00:01:41

passed #678458
amd64 linux
rwlock:sid:amd64

00:02:53

passed #678457
amd64 linux
tsan:buster:amd64

00:02:57

 
  Unit
passed #678481
amd64 linux
unit:asan:sid:amd64

00:01:11

passed #678487
amd64 freebsd
unit:clang:freebsd11.3:amd64

00:00:31

passed #678488
amd64 freebsd
unit:clang:freebsd12.0:amd64

00:00:34

passed #678485
amd64 linux
unit:clang:stretch:amd64

00:00:51

passed #678468
amd64 linux
unit:gcc:alpine3.11:amd64

00:00:45

passed #678480
amd64 linux
unit:gcc:bionic:amd64

00:00:57

passed #678474
amd64 linux
unit:gcc:buster:amd64

00:00:52

passed #678469
amd64 linux
unit:gcc:centos6:amd64

00:00:40

passed #678470
amd64 linux
unit:gcc:centos7:amd64

00:00:43

passed #678471
amd64 linux
unit:gcc:centos8:amd64

00:00:55

passed #678478
amd64 linux
unit:gcc:fedora31:amd64

00:00:47

passed #678472
amd64 linux
unit:gcc:jessie:amd64

00:00:32

passed #678475
amd64 linux
unit:gcc:sid:amd64

00:00:41

passed #678476
i386 linux
unit:gcc:sid:i386

00:00:50

passed #678473
amd64 linux
unit:gcc:stretch:amd64

00:00:53

passed #678477
amd64 linux
unit:gcc:tumbleweed:amd64

00:00:53

passed #678479
amd64 linux
unit:gcc:xenial:amd64

00:00:49

failed #678484
amd64 linux allowed to fail
unit:mutexatomics:sid:amd64

00:10:57

passed #678489
amd64 linux
unit:nolibtool:sid:amd64

00:01:12

passed #678486
amd64 linux
unit:pkcs11:sid:amd64

00:00:51

passed #678483
amd64 linux
unit:rwlock:sid:amd64

00:00:53

failed #678482
amd64 linux allowed to fail
unit:tsan:buster:amd64

00:02:25

 
  System
passed #678503
amd64 linux
system:asan:sid:amd64

00:14:57

failed #678508
amd64 freebsd
system:clang:freebsd11.3:amd64

00:12:58

failed #678509
amd64 freebsd
system:clang:freebsd12.0:amd64

00:12:49

passed #678490
amd64 linux
system:gcc:alpine3.11:amd64

00:13:45

passed #678502
amd64 linux
system:gcc:bionic:amd64

00:12:09

passed #678496
amd64 linux
system:gcc:buster:amd64

00:13:11

passed #678491
amd64 linux
system:gcc:centos6:amd64

00:12:49

passed #678492
amd64 linux
system:gcc:centos7:amd64

00:13:02

passed #678493
amd64 linux
system:gcc:centos8:amd64

00:13:06

passed #678500
amd64 linux
system:gcc:fedora31:amd64

00:13:32

passed #678494
amd64 linux
system:gcc:jessie:amd64

00:12:42

passed #678497
amd64 linux
system:gcc:sid:amd64

00:13:17

passed #678498
i386 linux
system:gcc:sid:i386

00:12:28

passed #678495
amd64 linux
system:gcc:stretch:amd64

00:12:01

passed #678499
amd64 linux
system:gcc:tumbleweed:amd64

00:12:25

passed #678501
amd64 linux
system:gcc:xenial:amd64

00:12:56

passed #678506
amd64 linux
system:mutexatomics:sid:amd64

00:13:25

passed #678510
amd64 linux
system:nolibtool:sid:amd64

00:12:55

passed #678507
amd64 linux
system:pkcs11:sid:amd64

00:12:25

passed #678505
amd64 linux
system:rwlock:sid:amd64

00:12:31

failed #678504
amd64 linux allowed to fail
system:tsan:buster:amd64

00:17:58

 
  Docs
passed #678511
amd64 linux
docs:sid:amd64

00:00:31

 
  Postcheck
passed #678513
amd64 linux
cppcheck:gcc:sid:amd64

00:03:33

passed #678512
amd64 linux
scan-build:buster:amd64

00:11:23

 
Name Stage Failure
failed
system:tsan:buster:amd64 System
make: *** [Makefile:486: test] Error 1
Running after script...
$ find bin -name 'tsan.*' -exec python3 util/parse_tsan.py {} \;
Uploading artifacts...
bin/tests/system/*/tsan.*: found 18 matching files
bin/tests/system/*/*/tsan.*: found 271 matching files

tsan/: found 209 matching files

Uploading artifacts to coordinator... ok
id=678504 responseStatus=201 Created token=ibMgJx5Z
ERROR: Job failed: exit code 1
failed
unit:mutexatomics:sid:amd64 Unit
Generating kyua_html/lib_ns_tests_query_test_main.html
Generating kyua_html/report.css
Generating kyua_html/index.html
Uploading artifacts...
kyua.log: found 1 matching files
kyua.results: found 1 matching files

kyua_html/: found 69 matching files

Uploading artifacts to coordinator... ok
id=678484 responseStatus=201 Created token=VcRhuFFk
ERROR: Job failed: exit code 1
failed
unit:tsan:buster:amd64 Unit
$ find lib -name 'tsan.*' -exec python3 util/parse_tsan.py {} \;
Uploading artifacts...
WARNING: lib/*/tests/tsan.*: no matching files
WARNING: tsan/: no matching files
kyua.log: found 1 matching files

kyua.results: found 1 matching files

WARNING: kyua_html/: no matching files
Uploading artifacts to coordinator... ok
id=678482 responseStatus=201 Created token=sxE4nkr7
ERROR: Job failed: exit code 1
failed
system:clang:freebsd11.3:amd64 System
I:      qmin
*** [test] Error code 1

make: stopped in /builds/isc-projects/bind9/bin/tests/system
Uploading artifacts...
Runtime platform arch=amd64 os=freebsd pid=40904 revision=de7731dd version=12.1.0
untracked: found 1378 files

Uploading artifacts to coordinator... ok
id=678508 responseStatus=201 Created token=cUAPxe2x
ERROR: Job failed: exit status 1
failed
system:clang:freebsd12.0:amd64 System
I:      reclimit
*** [test] Error code 1

make: stopped in /builds/isc-projects/bind9/bin/tests/system
Uploading artifacts...
Runtime platform arch=amd64 os=freebsd pid=40384 revision=de7731dd version=12.1.0
untracked: found 1362 files

Uploading artifacts to coordinator... ok
id=678509 responseStatus=201 Created token=znJ_bD8u
ERROR: Job failed: exit status 1
failed
oot:sid:amd64 Build There has been a runner system failure, please try again
Pulling docker image registry.gitlab.isc.org/isc-projects/images/bind9:debian-sid-amd64 ...
ERROR: Preparation failed: Error response from daemon: Get https://registry.gitlab.isc.org/v2/isc-projects/images/bind9/manifests/debian-sid-amd64: Get https://gitlab.isc.org/jwt/auth?account=ondrej&scope=repository%3Aisc-projects%2Fimages%2Fbind9%3Apull&service=container_registry: net/http: request canceled (Client.Timeout exceeded while awaiting headers) (executor_docker.go:188:15s)
Will be retried in 3s ...
Using Docker executor with image registry.gitlab.isc.org/isc-projects/images/bind9:debian-sid-amd64 ...
Authenticating with credentials from $DOCKER_AUTH_CONFIG
Pulling docker image registry.gitlab.isc.org/isc-projects/images/bind9:debian-sid-amd64 ...
ERROR: Preparation failed: Error response from daemon: Get https://registry.gitlab.isc.org/v2/isc-projects/images/bind9/manifests/debian-sid-amd64: Get https://gitlab.isc.org/jwt/auth?account=ondrej&scope=repository%3Aisc-projects%2Fimages%2Fbind9%3Apull&service=container_registry: net/http: request canceled (Client.Timeout exceeded while awaiting headers) (executor_docker.go:188:15s)
Will be retried in 3s ...
ERROR: Job failed (system failure): Error response from daemon: Get https://registry.gitlab.isc.org/v2/isc-projects/images/bind9/manifests/debian-sid-amd64: Get https://gitlab.isc.org/jwt/auth?account=ondrej&scope=repository%3Aisc-projects%2Fimages%2Fbind9%3Apull&service=container_registry: net/http: request canceled (Client.Timeout exceeded while awaiting headers) (executor_docker.go:188:15s)