Use isc_rwlock for isc_result tables

76 jobs for !3069 with wpk/perfwork-5-isc-result-rwlock in 28 minutes and 27 seconds (queued for 26 minutes and 7 seconds)
detached
Status Job ID Name Coverage
  Precheck
passed #678517
amd64 linux
🐞:sid:amd64

00:04:50

passed #678516
amd64 linux
💾:sid:amd64

00:00:25

passed #678514
amd64 linux
autoreconf:sid:amd64

00:00:34

passed #678515
amd64 linux
misc:sid:amd64

00:00:18

 
  Build
passed #678532
amd64 linux
asan:sid:amd64

00:04:33

passed #678539
amd64 freebsd
clang:freebsd11.3:amd64

00:01:15

passed #678540
amd64 freebsd
clang:freebsd12.0:amd64

00:01:05

passed #678541
amd64 libvirt
clang:openbsd6.6:amd64

00:05:11

passed #678536
amd64 linux
clang:stretch:amd64

00:01:28

passed #678537
i386 linux
clang:stretch:i386

00:00:57

passed #678518
amd64 linux
gcc:alpine3.11:amd64

00:02:50

passed #678531
amd64 linux
gcc:bionic:amd64

00:02:10

passed #678524
amd64 linux
gcc:buster:amd64

00:00:50

passed #678519
amd64 linux
gcc:centos6:amd64

00:01:26

passed #678520
amd64 linux
gcc:centos7:amd64

00:01:59

passed #678521
amd64 linux
gcc:centos8:amd64

00:02:21

passed #678529
amd64 linux
gcc:fedora31:amd64

00:02:19

passed #678522
amd64 linux
gcc:jessie:amd64

00:01:20

passed #678525
amd64 linux
gcc:sid:amd64

00:02:27

passed #678527
i386 linux
gcc:sid:i386

00:01:21

passed #678523
amd64 linux
gcc:stretch:amd64

00:01:25

passed #678528
amd64 linux
gcc:tumbleweed:amd64

00:01:37

passed #678530
amd64 linux
gcc:xenial:amd64

00:01:26

passed #678543
amd64 windows
msvc:windows:amd64

00:02:09

passed #678535
amd64 linux
mutexatomics:sid:amd64

00:01:27

passed #678542
amd64 linux
nolibtool:sid:amd64

00:02:01

passed #678526
amd64 linux
oot:sid:amd64

00:01:33

passed #678538
amd64 linux
pkcs11:sid:amd64

00:01:19

passed #678534
amd64 linux
rwlock:sid:amd64

00:02:32

passed #678533
amd64 linux
tsan:buster:amd64

00:03:11

 
  Unit
passed #678557
amd64 linux
unit:asan:sid:amd64

00:01:21

passed #678563
amd64 freebsd
unit:clang:freebsd11.3:amd64

00:00:38

passed #678564
amd64 freebsd
unit:clang:freebsd12.0:amd64

00:00:45

passed #678561
amd64 linux
unit:clang:stretch:amd64

00:00:51

passed #678544
amd64 linux
unit:gcc:alpine3.11:amd64

00:00:58

passed #678556
amd64 linux
unit:gcc:bionic:amd64

00:00:53

passed #678550
amd64 linux
unit:gcc:buster:amd64

00:00:50

passed #678545
amd64 linux
unit:gcc:centos6:amd64

00:00:56

passed #678546
amd64 linux
unit:gcc:centos7:amd64

00:00:52

passed #678547
amd64 linux
unit:gcc:centos8:amd64

00:00:54

passed #678554
amd64 linux
unit:gcc:fedora31:amd64

00:00:57

passed #678548
amd64 linux
unit:gcc:jessie:amd64

00:00:17

passed #678551
amd64 linux
unit:gcc:sid:amd64

00:00:39

passed #678552
i386 linux
unit:gcc:sid:i386

00:00:56

passed #678549
amd64 linux
unit:gcc:stretch:amd64

00:00:54

passed #678553
amd64 linux
unit:gcc:tumbleweed:amd64

00:00:53

passed #678555
amd64 linux
unit:gcc:xenial:amd64

00:00:55

failed #678560
amd64 linux allowed to fail
unit:mutexatomics:sid:amd64

00:10:51

passed #678565
amd64 linux
unit:nolibtool:sid:amd64

00:01:13

passed #678562
amd64 linux
unit:pkcs11:sid:amd64

00:00:38

passed #678559
amd64 linux
unit:rwlock:sid:amd64

00:00:53

failed #678558
amd64 linux allowed to fail
unit:tsan:buster:amd64

00:02:48

 
  System
passed #678579
amd64 linux
system:asan:sid:amd64

00:15:52

passed #678584
amd64 freebsd
system:clang:freebsd11.3:amd64

00:12:55

passed #678585
amd64 freebsd
system:clang:freebsd12.0:amd64

00:12:58

passed #678566
amd64 linux
system:gcc:alpine3.11:amd64

00:13:16

passed #678578
amd64 linux
system:gcc:bionic:amd64

00:13:05

passed #678572
amd64 linux
system:gcc:buster:amd64

00:13:24

passed #678567
amd64 linux
system:gcc:centos6:amd64

00:12:21

passed #678568
amd64 linux
system:gcc:centos7:amd64

00:12:44

passed #678569
amd64 linux
system:gcc:centos8:amd64

00:12:22

passed #678576
amd64 linux
system:gcc:fedora31:amd64

00:12:30

passed #678570
amd64 linux
system:gcc:jessie:amd64

00:12:24

passed #678573
amd64 linux
system:gcc:sid:amd64

00:12:28

passed #678574
i386 linux
system:gcc:sid:i386

00:13:15

failed #678571
amd64 linux
system:gcc:stretch:amd64

00:12:08

passed #678575
amd64 linux
system:gcc:tumbleweed:amd64

00:12:55

passed #678577
amd64 linux
system:gcc:xenial:amd64

00:12:32

passed #678582
amd64 linux
system:mutexatomics:sid:amd64

00:12:34

failed #678586
amd64 linux
system:nolibtool:sid:amd64

00:14:18

passed #678583
amd64 linux
system:pkcs11:sid:amd64

00:12:31

passed #678581
amd64 linux
system:rwlock:sid:amd64

00:13:10

failed #678580
amd64 linux allowed to fail
system:tsan:buster:amd64

00:18:45

 
  Docs
passed #678587
amd64 linux
docs:sid:amd64

00:00:56

 
  Postcheck
passed #678589
amd64 linux
cppcheck:gcc:sid:amd64

00:02:01

passed #678588
amd64 linux
scan-build:buster:amd64

00:11:31

 
Name Stage Failure
failed
system:tsan:buster:amd64 System
make: *** [Makefile:486: test] Error 1
Running after script...
$ find bin -name 'tsan.*' -exec python3 util/parse_tsan.py {} \;
Uploading artifacts...
bin/tests/system/*/tsan.*: found 18 matching files
bin/tests/system/*/*/tsan.*: found 270 matching files

tsan/: found 195 matching files

Uploading artifacts to coordinator... ok
id=678580 responseStatus=201 Created token=2YYeCCRh
ERROR: Job failed: exit code 1
failed
system:nolibtool:sid:amd64 System
I:      1 FAIL
I: 97 PASS
I:The following system tests failed:
I: views
make: *** [Makefile:486: test] Error 1
Uploading artifacts...
untracked: found 822 files
Uploading artifacts to coordinator... ok
id=678586 responseStatus=201 Created token=8MVwSFmn
ERROR: Job failed: exit code 1
failed
system:gcc:stretch:amd64 System
I:      1 SKIPPED
I:The following system tests failed:
I: inline
make: *** [test] Error 1
Makefile:484: recipe for target 'test' failed
Uploading artifacts...
untracked: found 1756 files
Uploading artifacts to coordinator... ok
id=678571 responseStatus=201 Created token=qMEsmsdF
ERROR: Job failed: exit code 1
failed
unit:mutexatomics:sid:amd64 Unit
Generating kyua_html/lib_ns_tests_query_test_main.html
Generating kyua_html/report.css
Generating kyua_html/index.html
Uploading artifacts...
kyua.log: found 1 matching files
kyua.results: found 1 matching files

kyua_html/: found 69 matching files

Uploading artifacts to coordinator... ok
id=678560 responseStatus=201 Created token=CZFgysRz
ERROR: Job failed: exit code 1
failed
unit:tsan:buster:amd64 Unit
$ find lib -name 'tsan.*' -exec python3 util/parse_tsan.py {} \;
Uploading artifacts...
WARNING: lib/*/tests/tsan.*: no matching files
WARNING: tsan/: no matching files
kyua.log: found 1 matching files

kyua.results: found 1 matching files

WARNING: kyua_html/: no matching files
Uploading artifacts to coordinator... ok
id=678558 responseStatus=201 Created token=q1THPUpo
ERROR: Job failed: exit code 1