Don't upgrade the lock before decrementing the reference

76 jobs for !3024 with 1609-use-native-rwlock-implementation in 10 minutes and 32 seconds (queued for 6 seconds)
detached
Status Job ID Name Coverage
  Precheck
failed #679305
amd64 linux
🐞:sid:amd64

00:04:47

passed #679304
amd64 linux
💾:sid:amd64

00:00:22

passed #679302
amd64 linux
autoreconf:sid:amd64

00:00:34

passed #679303
amd64 linux
misc:sid:amd64

00:00:17

 
  Build
failed #679320
amd64 linux
asan:sid:amd64

00:00:42

failed #679327
amd64 freebsd
clang:freebsd11.3:amd64

00:00:17

failed #679328
amd64 freebsd
clang:freebsd12.0:amd64

00:00:15

failed #679329
amd64 libvirt
clang:openbsd6.6:amd64

00:02:26

failed #679324
amd64 linux
clang:stretch:amd64

00:00:47

failed #679325
i386 linux
clang:stretch:i386

00:00:44

failed #679306
amd64 linux
gcc:alpine3.11:amd64

00:00:33

failed #679319
amd64 linux
gcc:bionic:amd64

00:00:28

failed #679312
amd64 linux
gcc:buster:amd64

00:00:30

failed #679307
amd64 linux
gcc:centos6:amd64

00:01:06

failed #679308
amd64 linux
gcc:centos7:amd64

00:00:48

failed #679309
amd64 linux
gcc:centos8:amd64

00:00:38

failed #679317
amd64 linux
gcc:fedora31:amd64

00:00:34

failed #679310
amd64 linux
gcc:jessie:amd64

00:00:46

failed #679313
amd64 linux
gcc:sid:amd64

00:00:48

failed #679315
i386 linux
gcc:sid:i386

00:00:30

failed #679311
amd64 linux
gcc:stretch:amd64

00:00:44

failed #679316
amd64 linux
gcc:tumbleweed:amd64

00:00:33

failed #679318
amd64 linux
gcc:xenial:amd64

00:00:29

failed #679331
amd64 windows
msvc:windows:amd64

00:01:00

failed #679323
amd64 linux
mutexatomics:sid:amd64

00:00:52

failed #679330
amd64 linux
nolibtool:sid:amd64

00:00:36

failed #679314
amd64 linux
oot:sid:amd64

00:00:44

failed #679326
amd64 linux
pkcs11:sid:amd64

00:00:25

failed #679322
amd64 linux
rwlock:sid:amd64

00:00:40

failed #679321
amd64 linux
tsan:buster:amd64

00:01:13

 
  Unit
skipped #679345
amd64 linux
unit:asan:sid:amd64
skipped #679351
amd64 freebsd
unit:clang:freebsd11.3:amd64
skipped #679352
amd64 freebsd
unit:clang:freebsd12.0:amd64
skipped #679349
amd64 linux
unit:clang:stretch:amd64
skipped #679332
amd64 linux
unit:gcc:alpine3.11:amd64
skipped #679344
amd64 linux
unit:gcc:bionic:amd64
skipped #679338
amd64 linux
unit:gcc:buster:amd64
skipped #679333
amd64 linux
unit:gcc:centos6:amd64
skipped #679334
amd64 linux
unit:gcc:centos7:amd64
skipped #679335
amd64 linux
unit:gcc:centos8:amd64
skipped #679342
amd64 linux
unit:gcc:fedora31:amd64
skipped #679336
amd64 linux
unit:gcc:jessie:amd64
skipped #679339
amd64 linux
unit:gcc:sid:amd64
skipped #679340
i386 linux
unit:gcc:sid:i386
skipped #679337
amd64 linux
unit:gcc:stretch:amd64
skipped #679341
amd64 linux
unit:gcc:tumbleweed:amd64
skipped #679343
amd64 linux
unit:gcc:xenial:amd64
skipped #679348
amd64 linux allowed to fail
unit:mutexatomics:sid:amd64
skipped #679353
amd64 linux
unit:nolibtool:sid:amd64
skipped #679350
amd64 linux
unit:pkcs11:sid:amd64
skipped #679347
amd64 linux
unit:rwlock:sid:amd64
skipped #679346
amd64 linux allowed to fail
unit:tsan:buster:amd64
 
  System
skipped #679367
amd64 linux
system:asan:sid:amd64
skipped #679372
amd64 freebsd
system:clang:freebsd11.3:amd64
skipped #679373
amd64 freebsd
system:clang:freebsd12.0:amd64
skipped #679354
amd64 linux
system:gcc:alpine3.11:amd64
skipped #679366
amd64 linux
system:gcc:bionic:amd64
skipped #679360
amd64 linux
system:gcc:buster:amd64
skipped #679355
amd64 linux
system:gcc:centos6:amd64
skipped #679356
amd64 linux
system:gcc:centos7:amd64
skipped #679357
amd64 linux
system:gcc:centos8:amd64
skipped #679364
amd64 linux
system:gcc:fedora31:amd64
skipped #679358
amd64 linux
system:gcc:jessie:amd64
skipped #679361
amd64 linux
system:gcc:sid:amd64
skipped #679362
i386 linux
system:gcc:sid:i386
skipped #679359
amd64 linux
system:gcc:stretch:amd64
skipped #679363
amd64 linux
system:gcc:tumbleweed:amd64
skipped #679365
amd64 linux
system:gcc:xenial:amd64
skipped #679370
amd64 linux allowed to fail
system:mutexatomics:sid:amd64
skipped #679374
amd64 linux
system:nolibtool:sid:amd64
skipped #679371
amd64 linux
system:pkcs11:sid:amd64
skipped #679369
amd64 linux
system:rwlock:sid:amd64
skipped #679368
amd64 linux allowed to fail
system:tsan:buster:amd64
 
  Docs
passed #679375
amd64 linux
docs:sid:amd64

00:00:33

 
  Postcheck
skipped #679377
amd64 linux
cppcheck:gcc:sid:amd64
passed #679376
amd64 linux
scan-build:buster:amd64

00:08:46

 
Name Stage Failure
failed
clang:openbsd6.6:amd64 Build
*** Error 1 in target 'dns_rdata_fromwire_text.lo', line 218 of Makefile (continuing)
Error target(s) unaccounted for: ../lib/dns/libdns.la dns_rdata_fromwire_text.lo dns_name_fromtext_target ../lib/isc/libisc.la main.lo testdirs dns_name_fromtext_target.lo all dns_rdata_fromwire_text
`all' not remade because of errors.
Errors while building
Errors while building
*** Error 1 in target 'subdirs', line 92 of Makefile (continuing)
Error target(s) unaccounted for: subdirs testdirs all
`all' not remade because of errors.
ERROR: Job failed: exit status 1
failed
🐞:sid:amd64 Precheck
-		RUNTIME_CHECK(isc_rwlock_unlock((lp), (t)) == ISC_R_SUCCESS); \
+ isc_rwlock_unlock((lp), (t)); \
} while (0)

/*
2 files match
738 files match
199 files match
ERROR: Job failed: exit code 1
failed
tsan:buster:amd64 Build
libtool: compile:  clang-9 -include /builds/isc-projects/bind9/config.h -I/builds/isc-projects/bind9 -I../.. -I./unix/include -I./pthreads/include -I./include -I./include -I/builds/isc-projects/bind9/lib/dns/include -I../../lib/dns/include -I/usr/include/json-c -I/usr/include/libxml2 -DISC_MEM_DEFAULTFILL=1 -DISC_LIST_CHECKINIT=1 -fno-omit-frame-pointer -fno-optimize-sibling-calls -O1 -g -Wall -Wextra -fsanitize=thread -DISC_MEM_USE_INTERNAL_MALLOC=0 -pthread -fPIC -W -Wall -Wmissing-prototypes -Wcast-qual -Wwrite-strings -Wformat -Wpointer-arith -Wno-missing-field-initializers -fno-strict-aliasing -Wshadow -Werror -c backtrace-emptytbl.c  -fPIC -DPIC -o .libs/backtrace-emptytbl.o
make[2]: Target 'all' not remade because of errors.
make[2]: Leaving directory '/builds/isc-projects/bind9/lib/isc'
make[1]: *** [Makefile:84: subdirs] Error 1
make[1]: Target 'all' not remade because of errors.
make[1]: Leaving directory '/builds/isc-projects/bind9/lib'
make: *** [Makefile:87: subdirs] Error 1
make: Target 'all' not remade because of errors.
ERROR: Job failed: exit code 1
failed
nolibtool:sid:amd64 Build
gcc  -include /builds/isc-projects/bind9/config.h -I/builds/isc-projects/bind9 -I../.. -I./unix/include -I./pthreads/include -I./include -I./include -I/builds/isc-projects/bind9/lib/dns/include -I../../lib/dns/include  -I/usr/include/json-c -I/usr/include/libxml2     -DISC_MEM_DEFAULTFILL=1 -DISC_LIST_CHECKINIT=1 -fno-omit-frame-pointer -fno-optimize-sibling-calls -O1 -g -Wall -Wextra -pthread   -fPIC  -W -Wall -Wmissing-prototypes -Wcast-qual -Wwrite-strings -Wformat -Wpointer-arith -Wno-missing-field-initializers -fno-strict-aliasing -Wshadow -Werror  -c backtrace-emptytbl.c
make[2]: Target 'all' not remade because of errors.
make[2]: Leaving directory '/builds/isc-projects/bind9/lib/isc'
make[1]: *** [Makefile:84: subdirs] Error 1
make[1]: Target 'all' not remade because of errors.
make[1]: Leaving directory '/builds/isc-projects/bind9/lib'
make: *** [Makefile:87: subdirs] Error 1
make: Target 'all' not remade because of errors.
ERROR: Job failed: exit code 1
failed
mutexatomics:sid:amd64 Build
libtool: compile:  gcc -include /builds/isc-projects/bind9/config.h -I/builds/isc-projects/bind9 -I../.. -I./unix/include -I./pthreads/include -I./include -I./include -I/builds/isc-projects/bind9/lib/dns/include -I../../lib/dns/include -I/usr/include/json-c -I/usr/include/libxml2 -DISC_MEM_DEFAULTFILL=1 -DISC_LIST_CHECKINIT=1 -fno-omit-frame-pointer -fno-optimize-sibling-calls -O1 -g -Wall -Wextra -DISC_MEM_USE_INTERNAL_MALLOC=0 -pthread -fPIC -W -Wall -Wmissing-prototypes -Wcast-qual -Wwrite-strings -Wformat -Wpointer-arith -Wno-missing-field-initializers -fno-strict-aliasing -Wshadow -Werror -c backtrace-emptytbl.c  -fPIC -DPIC -o .libs/backtrace-emptytbl.o
make[2]: Leaving directory '/builds/isc-projects/bind9/lib/isc'
make[2]: Target 'all' not remade because of errors.
make[1]: *** [Makefile:84: subdirs] Error 1
make[1]: Target 'all' not remade because of errors.
make[1]: Leaving directory '/builds/isc-projects/bind9/lib'
make: *** [Makefile:87: subdirs] Error 1
make: Target 'all' not remade because of errors.
ERROR: Job failed: exit code 1
failed
clang:stretch:i386 Build
make[2]: Leaving directory '/builds/isc-projects/bind9/lib/isc'
make[1]: *** [subdirs] Error 1
make[1]: Target 'all' not remade because of errors.
Makefile:84: recipe for target 'subdirs' failed
make[1]: Leaving directory '/builds/isc-projects/bind9/lib'
Makefile:87: recipe for target 'subdirs' failed
make: *** [subdirs] Error 1
make: Target 'all' not remade because of errors.
ERROR: Job failed: exit code 1
failed
clang:stretch:amd64 Build
make[2]: Leaving directory '/builds/isc-projects/bind9/lib/isc'
Makefile:84: recipe for target 'subdirs' failed
make[1]: Leaving directory '/builds/isc-projects/bind9/lib'
make[1]: *** [subdirs] Error 1
make[1]: Target 'all' not remade because of errors.
Makefile:87: recipe for target 'subdirs' failed
make: *** [subdirs] Error 1
make: Target 'all' not remade because of errors.
ERROR: Job failed: exit code 1
failed
pkcs11:sid:amd64 Build
libtool: compile:  gcc -include /builds/isc-projects/bind9/config.h -I/builds/isc-projects/bind9 -I../.. -I./unix/include -I./pthreads/include -I./include -I./include -I/builds/isc-projects/bind9/lib/dns/include -I../../lib/dns/include -I/usr/include/json-c -I/usr/include/libxml2 -DISC_MEM_DEFAULTFILL=1 -DISC_LIST_CHECKINIT=1 -fno-omit-frame-pointer -fno-optimize-sibling-calls -O1 -g -Wall -Wextra -pthread -fPIC -W -Wall -Wmissing-prototypes -Wcast-qual -Wwrite-strings -Wformat -Wpointer-arith -Wno-missing-field-initializers -fno-strict-aliasing -Wshadow -Werror -c backtrace-emptytbl.c  -fPIC -DPIC -o .libs/backtrace-emptytbl.o
make[2]: Target 'all' not remade because of errors.
make[2]: Leaving directory '/builds/isc-projects/bind9/lib/isc'
make[1]: *** [Makefile:84: subdirs] Error 1
make[1]: Target 'all' not remade because of errors.
make[1]: Leaving directory '/builds/isc-projects/bind9/lib'
make: *** [Makefile:87: subdirs] Error 1
make: Target 'all' not remade because of errors.
ERROR: Job failed: exit code 1
failed
rwlock:sid:amd64 Build
libtool: compile:  gcc -include /builds/isc-projects/bind9/config.h -I/builds/isc-projects/bind9 -I../.. -I./unix/include -I./pthreads/include -I./include -I./include -I/builds/isc-projects/bind9/lib/dns/include -I../../lib/dns/include -I/usr/include/json-c -I/usr/include/libxml2 -DISC_MEM_DEFAULTFILL=1 -DISC_LIST_CHECKINIT=1 -fno-omit-frame-pointer -fno-optimize-sibling-calls -O1 -g -Wall -Wextra -Wall -Wextra -O2 -g -DISC_MEM_USE_INTERNAL_MALLOC=0 -pthread -fPIC -W -Wall -Wmissing-prototypes -Wcast-qual -Wwrite-strings -Wformat -Wpointer-arith -Wno-missing-field-initializers -fno-strict-aliasing -Wshadow -Werror -c backtrace-emptytbl.c  -fPIC -DPIC -o .libs/backtrace-emptytbl.o
make[2]: Target 'all' not remade because of errors.
make[2]: Leaving directory '/builds/isc-projects/bind9/lib/isc'
make[1]: Leaving directory '/builds/isc-projects/bind9/lib'
make[1]: *** [Makefile:84: subdirs] Error 1
make[1]: Target 'all' not remade because of errors.
make: *** [Makefile:87: subdirs] Error 1
make: Target 'all' not remade because of errors.
ERROR: Job failed: exit code 1
failed
asan:sid:amd64 Build
libtool: compile:  gcc -include /builds/isc-projects/bind9/config.h -I/builds/isc-projects/bind9 -I../.. -I./unix/include -I./pthreads/include -I./include -I./include -I/builds/isc-projects/bind9/lib/dns/include -I../../lib/dns/include -I/usr/include/json-c -I/usr/include/libxml2 -DISC_MEM_DEFAULTFILL=1 -DISC_LIST_CHECKINIT=1 -fno-omit-frame-pointer -fno-optimize-sibling-calls -O1 -g -Wall -Wextra -fsanitize=address,undefined -DISC_MEM_USE_INTERNAL_MALLOC=0 -pthread -fPIC -W -Wall -Wmissing-prototypes -Wcast-qual -Wwrite-strings -Wformat -Wpointer-arith -Wno-missing-field-initializers -fno-strict-aliasing -Wshadow -Werror -c backtrace-emptytbl.c  -fPIC -DPIC -o .libs/backtrace-emptytbl.o
make[2]: Target 'all' not remade because of errors.
make[2]: Leaving directory '/builds/isc-projects/bind9/lib/isc'
make[1]: Leaving directory '/builds/isc-projects/bind9/lib'
make[1]: *** [Makefile:84: subdirs] Error 1
make[1]: Target 'all' not remade because of errors.
make: *** [Makefile:87: subdirs] Error 1
make: Target 'all' not remade because of errors.
ERROR: Job failed: exit code 1
failed
gcc:fedora31:amd64 Build
libtool: compile:  gcc -include /builds/isc-projects/bind9/config.h -I/builds/isc-projects/bind9 -I../.. -I./unix/include -I./pthreads/include -I./include -I./include -I/builds/isc-projects/bind9/lib/dns/include -I../../lib/dns/include -I/usr/include/json-c -I/usr/include/libxml2 -DISC_MEM_DEFAULTFILL=1 -DISC_LIST_CHECKINIT=1 -fno-omit-frame-pointer -fno-optimize-sibling-calls -O1 -g -Wall -Wextra -O1 -pthread -fPIC -W -Wall -Wmissing-prototypes -Wcast-qual -Wwrite-strings -Wformat -Wpointer-arith -Wno-missing-field-initializers -fno-strict-aliasing -Wshadow -Werror -c backtrace-emptytbl.c  -fPIC -DPIC -o .libs/backtrace-emptytbl.o
make[2]: Target 'all' not remade because of errors.
make[2]: Leaving directory '/builds/isc-projects/bind9/lib/isc'
make[1]: *** [Makefile:84: subdirs] Error 1
make[1]: Target 'all' not remade because of errors.
make[1]: Leaving directory '/builds/isc-projects/bind9/lib'
make: *** [Makefile:87: subdirs] Error 1
make: Target 'all' not remade because of errors.
ERROR: Job failed: exit code 1
failed
msvc:windows:amd64 Build
       (Link target) -> 
libisc.def : error LNK2001: unresolved external symbol isc_rwlock_tryupgrade [C:\builds\isc-projects\bind9\lib\isc\win32\libisc.vcxproj]
.\Release\libisc.lib : fatal error LNK1120: 1 unresolved externals [C:\builds\isc-projects\bind9\lib\isc\win32\libisc.vcxproj]

129 Warning(s)
2 Error(s)

Time Elapsed 00:00:19.78
ERROR: Job failed: exit status 1
failed
gcc:bionic:amd64 Build
make[2]: Leaving directory '/builds/isc-projects/bind9/lib/isc'
make[1]: *** [subdirs] Error 1
make[1]: Target 'all' not remade because of errors.
Makefile:84: recipe for target 'subdirs' failed
make[1]: Leaving directory '/builds/isc-projects/bind9/lib'
Makefile:87: recipe for target 'subdirs' failed
make: *** [subdirs] Error 1
make: Target 'all' not remade because of errors.
ERROR: Job failed: exit code 1
failed
gcc:centos6:amd64 Build
libtool: compile:  gcc -std=gnu99 -include /builds/isc-projects/bind9/config.h -I/builds/isc-projects/bind9 -I../.. -I. -I../../lib/dns -Iinclude -I/builds/isc-projects/bind9/lib/dns/include -I../../lib/dns/include -I/builds/isc-projects/bind9/lib/isc/include -I../../lib/isc -I../../lib/isc/include -I../../lib/isc/unix/include -I../../lib/isc/pthreads/include -I/usr/include -I/usr/include/json-c -I/usr/include/libxml2 -DGSSAPI -DUSE_ISC_SPNEGO -DISC_MEM_DEFAULTFILL=1 -DISC_LIST_CHECKINIT=1 -fno-omit-frame-pointer -fno-optimize-sibling-calls -O1 -g -Wall -Wextra -pthread -fPIC -W -Wall -Wmissing-prototypes -Wcast-qual -Wwrite-strings -Wformat -Wpointer-arith -Wno-missing-field-initializers -fno-strict-aliasing -Wshadow -c geoip2.c  -fPIC -DPIC -o .libs/geoip2.o
make[2]: Leaving directory `/builds/isc-projects/bind9/lib/dns'
make[2]: Target `all' not remade because of errors.
make[1]: Leaving directory `/builds/isc-projects/bind9/lib'
make[1]: *** [subdirs] Error 1
make[1]: Target `all' not remade because of errors.
make: *** [subdirs] Error 1
make: Target `all' not remade because of errors.
ERROR: Job failed: exit code 1
failed
gcc:tumbleweed:amd64 Build
libtool: compile:  gcc -include /builds/isc-projects/bind9/config.h -I/builds/isc-projects/bind9 -I../.. -I./unix/include -I./pthreads/include -I./include -I./include -I/builds/isc-projects/bind9/lib/dns/include -I../../lib/dns/include -DOPENSSL_LOAD_CONF -I/usr/include/json-c -I/usr/include/libxml2 -DISC_MEM_DEFAULTFILL=1 -DISC_LIST_CHECKINIT=1 -fno-omit-frame-pointer -fno-optimize-sibling-calls -O1 -g -Wall -Wextra -pthread -fPIC -W -Wall -Wmissing-prototypes -Wcast-qual -Wwrite-strings -Wformat -Wpointer-arith -Wno-missing-field-initializers -fno-strict-aliasing -Wshadow -Werror -c backtrace-emptytbl.c  -fPIC -DPIC -o .libs/backtrace-emptytbl.o
make[2]: Target 'all' not remade because of errors.
make[2]: Leaving directory '/builds/isc-projects/bind9/lib/isc'
make[1]: *** [Makefile:84: subdirs] Error 1
make[1]: Target 'all' not remade because of errors.
make[1]: Leaving directory '/builds/isc-projects/bind9/lib'
make: *** [Makefile:87: subdirs] Error 1
make: Target 'all' not remade because of errors.
ERROR: Job failed: exit code 1
failed
gcc:xenial:amd64 Build
make[2]: Leaving directory '/builds/isc-projects/bind9/lib/isc'
make[1]: *** [subdirs] Error 1
make[1]: Target 'all' not remade because of errors.
Makefile:84: recipe for target 'subdirs' failed
make[1]: Leaving directory '/builds/isc-projects/bind9/lib'
make: *** [subdirs] Error 1
make: Target 'all' not remade because of errors.
Makefile:87: recipe for target 'subdirs' failed
ERROR: Job failed: exit code 1
failed
gcc:sid:amd64 Build
libtool: compile:  gcc -include /builds/isc-projects/bind9/config.h -I/builds/isc-projects/bind9 -I../.. -I./unix/include -I./pthreads/include -I./include -I./include -I/builds/isc-projects/bind9/lib/dns/include -I../../lib/dns/include -I/usr/include/json-c -I/usr/include/libxml2 -DISC_MEM_DEFAULTFILL=1 -DISC_LIST_CHECKINIT=1 -fno-omit-frame-pointer -fno-optimize-sibling-calls -O1 -g -Wall -Wextra -O3 -pthread -I/usr/include/google -fPIC -W -Wall -Wmissing-prototypes -Wcast-qual -Wwrite-strings -Wformat -Wpointer-arith -Wno-missing-field-initializers -fno-strict-aliasing -Wshadow -Werror -c backtrace-emptytbl.c  -fPIC -DPIC -o .libs/backtrace-emptytbl.o
make[2]: Target 'all' not remade because of errors.
make[2]: Leaving directory '/builds/isc-projects/bind9/lib/isc'
make[1]: *** [Makefile:84: subdirs] Error 1
make[1]: Target 'all' not remade because of errors.
make[1]: Leaving directory '/builds/isc-projects/bind9/lib'
make: *** [Makefile:87: subdirs] Error 1
make: Target 'all' not remade because of errors.
ERROR: Job failed: exit code 1
failed
gcc:centos7:amd64 Build
libtool: compile:  gcc -std=gnu99 -include /builds/isc-projects/bind9/config.h -I/builds/isc-projects/bind9 -I../.. -I./unix/include -I./pthreads/include -I./include -I./include -I/builds/isc-projects/bind9/lib/dns/include -I../../lib/dns/include -I/usr/include/json-c -I/usr/include/libxml2 -DISC_MEM_DEFAULTFILL=1 -DISC_LIST_CHECKINIT=1 -fno-omit-frame-pointer -fno-optimize-sibling-calls -O1 -g -Wall -Wextra -pthread -I/usr/include/google -fPIC -W -Wall -Wmissing-prototypes -Wcast-qual -Wwrite-strings -Wformat -Wpointer-arith -Wno-missing-field-initializers -fno-strict-aliasing -Wshadow -Werror -c backtrace-emptytbl.c  -fPIC -DPIC -o .libs/backtrace-emptytbl.o
make[2]: Target `all' not remade because of errors.
make[2]: Leaving directory `/builds/isc-projects/bind9/lib/isc'
make[1]: *** [subdirs] Error 1
make[1]: Target `all' not remade because of errors.
make[1]: Leaving directory `/builds/isc-projects/bind9/lib'
make: *** [subdirs] Error 1
make: Target `all' not remade because of errors.
ERROR: Job failed: exit code 1
failed
gcc:jessie:amd64 Build
make[2]: Leaving directory '/builds/isc-projects/bind9/lib/isc'
Makefile:84: recipe for target 'subdirs' failed
make[1]: Leaving directory '/builds/isc-projects/bind9/lib'
make[1]: *** [subdirs] Error 1
make[1]: Target 'all' not remade because of errors.
Makefile:87: recipe for target 'subdirs' failed
make: *** [subdirs] Error 1
make: Target 'all' not remade because of errors.
ERROR: Job failed: exit code 1
failed
oot:sid:amd64 Build
libtool: compile:  gcc -include /builds/isc-projects/bind9/workspace/config.h -I/builds/isc-projects/bind9/workspace -I../../.. -I../../../lib/isc/unix/include -I../../../lib/isc/pthreads/include -I./include -I../../../lib/isc/include -I/builds/isc-projects/bind9/workspace/lib/dns/include -I../../../lib/dns/include -I/usr/include/json-c -I/usr/include/libxml2 -DISC_MEM_DEFAULTFILL=1 -DISC_LIST_CHECKINIT=1 -fno-omit-frame-pointer -fno-optimize-sibling-calls -O1 -g -Wall -Wextra -O3 -pthread -I/usr/include/google -fPIC -W -Wall -Wmissing-prototypes -Wcast-qual -Wwrite-strings -Wformat -Wpointer-arith -Wno-missing-field-initializers -fno-strict-aliasing -Wshadow -Werror -c ../../../lib/isc/backtrace-emptytbl.c  -fPIC -DPIC -o .libs/backtrace-emptytbl.o
make[2]: Target 'all' not remade because of errors.
make[2]: Leaving directory '/builds/isc-projects/bind9/workspace/lib/isc'
make[1]: *** [Makefile:84: subdirs] Error 1
make[1]: Target 'all' not remade because of errors.
make[1]: Leaving directory '/builds/isc-projects/bind9/workspace/lib'
make: *** [Makefile:87: subdirs] Error 1
make: Target 'all' not remade because of errors.
ERROR: Job failed: exit code 1
failed
gcc:stretch:amd64 Build
make[2]: Target 'all' not remade because of errors.
Makefile:84: recipe for target 'subdirs' failed
make[1]: *** [subdirs] Error 1
make[1]: Target 'all' not remade because of errors.
make[1]: Leaving directory '/builds/isc-projects/bind9/lib'
make: *** [subdirs] Error 1
make: Target 'all' not remade because of errors.
Makefile:87: recipe for target 'subdirs' failed
ERROR: Job failed: exit code 1
failed
gcc:centos8:amd64 Build
libtool: compile:  gcc -include /builds/isc-projects/bind9/config.h -I/builds/isc-projects/bind9 -I../.. -I./unix/include -I./pthreads/include -I./include -I./include -I/builds/isc-projects/bind9/lib/dns/include -I../../lib/dns/include -I/usr/include/json-c -I/usr/include/libxml2 -DISC_MEM_DEFAULTFILL=1 -DISC_LIST_CHECKINIT=1 -fno-omit-frame-pointer -fno-optimize-sibling-calls -O1 -g -Wall -Wextra -pthread -fPIC -W -Wall -Wmissing-prototypes -Wcast-qual -Wwrite-strings -Wformat -Wpointer-arith -Wno-missing-field-initializers -fno-strict-aliasing -Wshadow -Werror -c backtrace-emptytbl.c  -fPIC -DPIC -o .libs/backtrace-emptytbl.o
make[2]: Target 'all' not remade because of errors.
make[2]: Leaving directory '/builds/isc-projects/bind9/lib/isc'
make[1]: *** [Makefile:84: subdirs] Error 1
make[1]: Target 'all' not remade because of errors.
make[1]: Leaving directory '/builds/isc-projects/bind9/lib'
make: *** [Makefile:87: subdirs] Error 1
make: Target 'all' not remade because of errors.
ERROR: Job failed: exit code 1
failed
gcc:alpine3.11:amd64 Build
libtool: compile:  gcc -include /builds/isc-projects/bind9/config.h -I/builds/isc-projects/bind9 -I../.. -I./unix/include -I./pthreads/include -I./include -I./include -I/builds/isc-projects/bind9/lib/dns/include -I../../lib/dns/include -I/usr/include/json-c -I/usr/include/libxml2 -DISC_MEM_DEFAULTFILL=1 -DISC_LIST_CHECKINIT=1 -fno-omit-frame-pointer -fno-optimize-sibling-calls -O1 -g -Wall -Wextra -pthread -I/usr/include/google -fPIC -W -Wall -Wmissing-prototypes -Wcast-qual -Wwrite-strings -Wformat -Wpointer-arith -Wno-missing-field-initializers -fno-strict-aliasing -Wshadow -Werror -c backtrace-emptytbl.c  -fPIC -DPIC -o .libs/backtrace-emptytbl.o
make[2]: Target 'all' not remade because of errors.
make[2]: Leaving directory '/builds/isc-projects/bind9/lib/isc'
make[1]: *** [Makefile:84: subdirs] Error 1
make[1]: Target 'all' not remade because of errors.
make[1]: Leaving directory '/builds/isc-projects/bind9/lib'
make: *** [Makefile:87: subdirs] Error 1
make: Target 'all' not remade because of errors.
ERROR: Job failed: exit code 1
failed
gcc:sid:i386 Build
libtool: compile:  gcc -include /builds/isc-projects/bind9/config.h -I/builds/isc-projects/bind9 -I../.. -I./unix/include -I./pthreads/include -I./include -I./include -I/builds/isc-projects/bind9/lib/dns/include -I../../lib/dns/include -I/usr/include/json-c -I/usr/include/libxml2 -DISC_MEM_DEFAULTFILL=1 -DISC_LIST_CHECKINIT=1 -fno-omit-frame-pointer -fno-optimize-sibling-calls -O1 -g -Wall -Wextra -pthread -I/usr/include/google -fPIC -W -Wall -Wmissing-prototypes -Wcast-qual -Wwrite-strings -Wformat -Wpointer-arith -Wno-missing-field-initializers -fno-strict-aliasing -Wshadow -Werror -c backtrace-emptytbl.c  -fPIC -DPIC -o .libs/backtrace-emptytbl.o
make[2]: Target 'all' not remade because of errors.
make[2]: Leaving directory '/builds/isc-projects/bind9/lib/isc'
make[1]: *** [Makefile:84: subdirs] Error 1
make[1]: Target 'all' not remade because of errors.
make[1]: Leaving directory '/builds/isc-projects/bind9/lib'
make: *** [Makefile:87: subdirs] Error 1
make: Target 'all' not remade because of errors.
ERROR: Job failed: exit code 1
failed
gcc:buster:amd64 Build
libtool: compile:  gcc -include /builds/isc-projects/bind9/config.h -I/builds/isc-projects/bind9 -I../.. -I./unix/include -I./pthreads/include -I./include -I./include -I/builds/isc-projects/bind9/lib/dns/include -I../../lib/dns/include -I/usr/include/json-c -I/usr/include/libxml2 -DISC_MEM_DEFAULTFILL=1 -DISC_LIST_CHECKINIT=1 -fno-omit-frame-pointer -fno-optimize-sibling-calls -O1 -g -Wall -Wextra -pthread -fPIC -W -Wall -Wmissing-prototypes -Wcast-qual -Wwrite-strings -Wformat -Wpointer-arith -Wno-missing-field-initializers -fno-strict-aliasing -Wshadow -Werror -c backtrace-emptytbl.c  -fPIC -DPIC -o .libs/backtrace-emptytbl.o
make[2]: Leaving directory '/builds/isc-projects/bind9/lib/isc'
make[2]: Target 'all' not remade because of errors.
make[1]: Leaving directory '/builds/isc-projects/bind9/lib'
make[1]: *** [Makefile:84: subdirs] Error 1
make[1]: Target 'all' not remade because of errors.
make: *** [Makefile:87: subdirs] Error 1
make: Target 'all' not remade because of errors.
ERROR: Job failed: exit code 1
failed
clang:freebsd11.3:amd64 Build
/bin/sh /builds/isc-projects/bind9/libtool --mode=compile cc  -include /builds/isc-projects/bind9/config.h -I/builds/isc-projects/bind9 -I../.. -I./unix/include  -I./pthreads/include  -I./include  -I./include -I/builds/isc-projects/bind9/lib/dns/include  -I../../lib/dns/include  -I/usr/include  -I/usr/local/include/json-c  -I/usr/local/include/libxml2       -DISC_MEM_DEFAULTFILL=1 -DISC_LIST_CHECKINIT=1 -fno-omit-frame-pointer -fno-optimize-sibling-calls -O1 -g -Wall -Wextra -pthread -I/usr/local/include  -I /usr/local/include -fPIC   -W -Wall -Wmissing-prototypes -Wcast-qual -Wwrite-strings -Wformat -Wpointer-arith -Wno-missing-field-initializers -fno-strict-aliasing -Wshadow -Werror  -c backtrace-emptytbl.c
libtool: compile: cc -include /builds/isc-projects/bind9/config.h -I/builds/isc-projects/bind9 -I../.. -I./unix/include -I./pthreads/include -I./include -I./include -I/builds/isc-projects/bind9/lib/dns/include -I../../lib/dns/include -I/usr/include -I/usr/local/include/json-c -I/usr/local/include/libxml2 -DISC_MEM_DEFAULTFILL=1 -DISC_LIST_CHECKINIT=1 -fno-omit-frame-pointer -fno-optimize-sibling-calls -O1 -g -Wall -Wextra -pthread -I/usr/local/include -I /usr/local/include -fPIC -W -Wall -Wmissing-prototypes -Wcast-qual -Wwrite-strings -Wformat -Wpointer-arith -Wno-missing-field-initializers -fno-strict-aliasing -Wshadow -Werror -c backtrace-emptytbl.c -fPIC -DPIC -o .libs/backtrace-emptytbl.o
*** [subdirs] Error code 1

make[1]: stopped in /builds/isc-projects/bind9/lib
*** [subdirs] Error code 1

make: stopped in /builds/isc-projects/bind9
ERROR: Job failed: exit status 1
failed
clang:freebsd12.0:amd64 Build
/bin/sh /builds/isc-projects/bind9/libtool --mode=compile cc  -include /builds/isc-projects/bind9/config.h -I/builds/isc-projects/bind9 -I../.. -I./unix/include  -I./pthreads/include  -I./include  -I./include -I/builds/isc-projects/bind9/lib/dns/include  -I../../lib/dns/include  -I/usr/include  -I/usr/local/include/json-c  -I/usr/local/include/libxml2       -DISC_MEM_DEFAULTFILL=1 -DISC_LIST_CHECKINIT=1 -fno-omit-frame-pointer -fno-optimize-sibling-calls -O1 -g -Wall -Wextra -pthread -I/usr/local/include  -I /usr/local/include -I/usr/local/include/google -fPIC   -W -Wall -Wmissing-prototypes -Wcast-qual -Wwrite-strings -Wformat -Wpointer-arith -Wno-missing-field-initializers -fno-strict-aliasing -Wshadow -Werror  -c backtrace-emptytbl.c
libtool: compile: cc -include /builds/isc-projects/bind9/config.h -I/builds/isc-projects/bind9 -I../.. -I./unix/include -I./pthreads/include -I./include -I./include -I/builds/isc-projects/bind9/lib/dns/include -I../../lib/dns/include -I/usr/include -I/usr/local/include/json-c -I/usr/local/include/libxml2 -DISC_MEM_DEFAULTFILL=1 -DISC_LIST_CHECKINIT=1 -fno-omit-frame-pointer -fno-optimize-sibling-calls -O1 -g -Wall -Wextra -pthread -I/usr/local/include -I /usr/local/include -I/usr/local/include/google -fPIC -W -Wall -Wmissing-prototypes -Wcast-qual -Wwrite-strings -Wformat -Wpointer-arith -Wno-missing-field-initializers -fno-strict-aliasing -Wshadow -Werror -c backtrace-emptytbl.c -fPIC -DPIC -o .libs/backtrace-emptytbl.o
*** [subdirs] Error code 1

make[1]: stopped in /builds/isc-projects/bind9/lib
*** [subdirs] Error code 1

make: stopped in /builds/isc-projects/bind9
ERROR: Job failed: exit status 1