fixup! Use isc_rwlock to lock .logconfig member of isc_log_t

77 jobs for !3251 with marka-1675-logfileconfig-system-test-crashes-occasionally-rwlock in 25 minutes and 54 seconds (queued for 2 minutes and 17 seconds)
detached
Status Job ID Name Coverage
  Precheck
passed #766081
amd64 linux
🐞:sid:amd64

00:04:36

passed #766080
amd64 linux
💾:sid:amd64

00:00:25

passed #766078
amd64 linux
autoreconf:sid:amd64

00:00:20

passed #766079
amd64 linux
misc:sid:amd64

00:00:18

 
  Build
passed #766097
amd64 linux
asan:sid:amd64

00:01:39

passed #766104
amd64 libvirt
clang:freebsd11.3:amd64

00:04:02

passed #766105
amd64 libvirt
clang:freebsd12.1:amd64

00:04:08

passed #766106
amd64 libvirt
clang:openbsd6.6:amd64

00:04:50

passed #766101
amd64 linux
clang:stretch:amd64

00:01:37

passed #766102
i386 linux
clang:stretch:i386

00:01:27

passed #766082
amd64 linux
gcc:alpine3.11:amd64

00:02:26

passed #766096
amd64 linux
gcc:bionic:amd64

00:01:39

passed #766088
amd64 linux
gcc:buster:amd64

00:01:32

passed #766083
amd64 linux
gcc:centos6:amd64

00:02:02

passed #766084
amd64 linux
gcc:centos7:amd64

00:02:01

passed #766085
amd64 linux
gcc:centos8:amd64

00:02:18

passed #766094
amd64 linux
gcc:fedora31:amd64

00:02:30

passed #766086
amd64 linux
gcc:jessie:amd64

00:01:22

passed #766089
amd64 linux
gcc:sid:amd64

00:03:16

passed #766091
arm64 linux
gcc:sid:arm64

00:04:08

passed #766092
i386 linux
gcc:sid:i386

00:01:49

passed #766087
amd64 linux
gcc:stretch:amd64

00:02:27

passed #766093
amd64 linux
gcc:tumbleweed:amd64

00:02:29

passed #766095
amd64 linux
gcc:xenial:amd64

00:01:23

passed #766107
amd64 windows
msvc:windows:amd64

00:02:41

passed #766100
amd64 linux
mutexatomics:sid:amd64

00:02:14

passed #766090
amd64 linux
oot:sid:amd64

00:03:24

passed #766103
amd64 linux
pkcs11:sid:amd64

00:01:29

passed #766099
amd64 linux
rwlock:sid:amd64

00:02:32

passed #766098
amd64 linux
tsan:buster:amd64

00:02:59

 
  Unit
passed #766122
amd64 linux
unit:asan:sid:amd64

00:00:57

passed #766128
amd64 libvirt
unit:clang:freebsd11.3:amd64

00:01:27

failed #766129
amd64 libvirt
unit:clang:freebsd12.1:amd64

00:06:28

passed #766126
amd64 linux
unit:clang:stretch:amd64

00:00:52

passed #766108
amd64 linux
unit:gcc:alpine3.11:amd64

00:01:00

passed #766121
amd64 linux
unit:gcc:bionic:amd64

00:00:40

passed #766114
amd64 linux
unit:gcc:buster:amd64

00:00:53

passed #766109
amd64 linux
unit:gcc:centos6:amd64

00:00:55

passed #766110
amd64 linux
unit:gcc:centos7:amd64

00:00:55

passed #766111
amd64 linux
unit:gcc:centos8:amd64

00:00:53

passed #766119
amd64 linux
unit:gcc:fedora31:amd64

00:00:54

passed #766112
amd64 linux
unit:gcc:jessie:amd64

00:00:29

passed #766115
amd64 linux
unit:gcc:sid:amd64

00:00:54

passed #766116
arm64 linux
unit:gcc:sid:arm64

00:01:10

passed #766117
i386 linux
unit:gcc:sid:i386

00:00:56

passed #766113
amd64 linux
unit:gcc:stretch:amd64

00:00:54

passed #766118
amd64 linux
unit:gcc:tumbleweed:amd64

00:00:55

passed #766120
amd64 linux
unit:gcc:xenial:amd64

00:00:46

passed #766125
amd64 linux
unit:mutexatomics:sid:amd64

00:00:54

passed #766127
amd64 linux
unit:pkcs11:sid:amd64

00:00:51

passed #766124
amd64 linux
unit:rwlock:sid:amd64

00:00:49

failed #766123
amd64 linux allowed to fail
unit:tsan:buster:amd64

00:02:48

 
  System
passed #766144
amd64 linux
system:asan:sid:amd64

00:13:09

passed #766149
amd64 libvirt
system:clang:freebsd11.3:amd64

00:15:16

passed #766150
amd64 libvirt
system:clang:freebsd12.1:amd64

00:12:26

failed #766130
amd64 linux
system:gcc:alpine3.11:amd64

00:11:11

passed #766143
amd64 linux
system:gcc:bionic:amd64

00:11:54

passed #766136
amd64 linux
system:gcc:buster:amd64

00:10:08

passed #766131
amd64 linux
system:gcc:centos6:amd64

00:10:30

passed #766132
amd64 linux
system:gcc:centos7:amd64

00:11:52

passed #766133
amd64 linux
system:gcc:centos8:amd64

00:10:40

passed #766141
amd64 linux
system:gcc:fedora31:amd64

00:10:30

passed #766134
amd64 linux
system:gcc:jessie:amd64

00:10:05

passed #766137
amd64 linux
system:gcc:sid:amd64

00:10:18

passed #766138
arm64 linux
system:gcc:sid:arm64

00:12:07

passed #766139
i386 linux
system:gcc:sid:i386

00:12:10

passed #766135
amd64 linux
system:gcc:stretch:amd64

00:09:35

failed #766140
amd64 linux
system:gcc:tumbleweed:amd64

00:11:45

passed #766142
amd64 linux
system:gcc:xenial:amd64

00:09:43

passed #766147
amd64 linux
system:mutexatomics:sid:amd64

00:12:00

passed #766148
amd64 linux
system:pkcs11:sid:amd64

00:12:44

passed #766146
amd64 linux
system:rwlock:sid:amd64

00:09:52

failed #766145
amd64 linux allowed to fail
system:tsan:buster:amd64

00:15:15

 
  Docs
passed #766151
amd64 linux
docs:sid:amd64

00:00:38

 
  Postcheck
passed #766153
amd64 linux
cppcheck:gcc:sid:amd64

00:02:41

passed #766154
arm64 linux
cppcheck:gcc:sid:arm64

00:02:15

passed #766152
amd64 linux
scan-build:buster:amd64

00:11:58

 
Name Stage Failure
failed
system:tsan:buster:amd64 System
make: *** [Makefile:441: test] Error 1
Running after script...
$ find bin -name 'tsan.*' -exec python3 util/parse_tsan.py {} \;
Uploading artifacts...
bin/tests/system/*/tsan.*: found 18 matching files
bin/tests/system/*/*/tsan.*: found 241 matching files

tsan/: found 196 matching files

Uploading artifacts to coordinator... ok
id=766145 responseStatus=201 Created token=12zTrjeq
ERROR: Job failed: exit code 1
failed
unit:clang:freebsd12.1:amd64 Unit
Generating kyua_html/report.css
Generating kyua_html/index.html
Uploading artifacts...
Runtime platform arch=amd64 os=freebsd pid=1771 revision=1b659122 version=12.8.0
kyua.log: found 1 matching files

kyua.results: found 1 matching files

kyua_html/: found 69 matching files

Uploading artifacts to coordinator... ok
id=766129 responseStatus=201 Created token=zwu1xd1C
ERROR: Job failed: exit status 1
failed
system:gcc:tumbleweed:amd64 System
I:The following system tests failed:
I: legacy
I:Core dumps were found for the following system tests:
I: legacy
make: *** [Makefile:441: test] Error 1
Uploading artifacts...
untracked: found 1384 files
Uploading artifacts to coordinator... ok
id=766140 responseStatus=201 Created token=zfrcymVY
ERROR: Job failed: exit code 1
failed
system:gcc:alpine3.11:amd64 System
I:      1 FAIL
I: 99 PASS
I:The following system tests failed:
I: rpzrecurse
make: *** [Makefile:441: test] Error 1
Uploading artifacts...
untracked: found 2751 files
Uploading artifacts to coordinator... ok
id=766130 responseStatus=201 Created token=yXMmzsAD
ERROR: Job failed: exit code 1
failed
unit:tsan:buster:amd64 Unit
$ find lib -name 'tsan.*' -exec python3 util/parse_tsan.py {} \;
Uploading artifacts...
WARNING: lib/*/tests/tsan.*: no matching files
WARNING: tsan/: no matching files
kyua.log: found 1 matching files

kyua.results: found 1 matching files

WARNING: kyua_html/: no matching files
Uploading artifacts to coordinator... ok
id=766123 responseStatus=201 Created token=tnhcYhjb
ERROR: Job failed: exit code 1