fixup! Added test for nsdname-wait-recurse option

Status Job ID Name Coverage
  Precheck
passed #768892
amd64 linux
🐞:sid:amd64

00:01:06

passed #768890
amd64 linux
autoreconf:sid:amd64

00:00:33

passed #768891
amd64 linux
misc:sid:amd64

00:00:17

 
  Build
passed #768907
amd64 linux
asan:sid:amd64

00:01:42

passed #768912
amd64 libvirt
clang:freebsd11.3:amd64

00:02:19

passed #768913
amd64 libvirt
clang:freebsd12.1:amd64

00:02:52

passed #768914
amd64 libvirt
clang:openbsd6.6:amd64

00:05:59

failed #768908
amd64 linux
clang:stretch:amd64

00:00:47

passed #768909
i386 linux
clang:stretch:i386

00:02:07

passed #768893
amd64 linux
gcc:alpine3.11:amd64

00:02:55

passed #768906
amd64 linux
gcc:bionic:amd64

00:03:03

passed #768899
amd64 linux
gcc:buster:amd64

00:02:06

passed #768894
amd64 linux
gcc:centos6:amd64

00:02:23

passed #768895
amd64 linux
gcc:centos7:amd64

00:02:41

passed #768896
amd64 linux
gcc:centos8:amd64

00:02:51

passed #768904
amd64 linux
gcc:fedora31:amd64

00:01:48

passed #768897
amd64 linux
gcc:jessie:amd64

00:02:33

passed #768900
amd64 linux
gcc:sid:amd64

00:02:01

passed #768902
i386 linux
gcc:sid:i386

00:03:30

passed #768898
amd64 linux
gcc:stretch:amd64

00:03:13

passed #768903
amd64 linux
gcc:tumbleweed:amd64

00:01:47

passed #768905
amd64 linux
gcc:xenial:amd64

00:01:39

passed #768916
amd64 windows
msvc:windows:amd64

00:02:37

passed #768910
amd64 linux
nocrypto:sid:amd64

00:01:32

passed #768915
amd64 linux
nolibtool:sid:amd64

00:01:43

passed #768901
amd64 linux
oot:sid:amd64

00:02:53

passed #768911
amd64 linux
pkcs11:sid:amd64

00:01:30

 
  Unit
passed #768930
amd64 linux
unit:asan:sid:amd64

00:01:57

passed #768934
amd64 libvirt
unit:clang:freebsd11.3:amd64

00:01:10

passed #768935
amd64 libvirt
unit:clang:freebsd12.1:amd64

00:00:58

skipped #768931
amd64 linux
unit:clang:stretch:amd64
passed #768917
amd64 linux
unit:gcc:alpine3.11:amd64

00:00:57

passed #768929
amd64 linux
unit:gcc:bionic:amd64

00:00:54

passed #768923
amd64 linux
unit:gcc:buster:amd64

00:00:49

passed #768918
amd64 linux
unit:gcc:centos6:amd64

00:01:06

passed #768919
amd64 linux
unit:gcc:centos7:amd64

00:01:01

passed #768920
amd64 linux
unit:gcc:centos8:amd64

00:00:56

passed #768927
amd64 linux
unit:gcc:fedora31:amd64

00:01:02

passed #768921
amd64 linux
unit:gcc:jessie:amd64

00:00:15

passed #768924
amd64 linux
unit:gcc:sid:amd64

00:00:34

passed #768925
i386 linux
unit:gcc:sid:i386

00:00:47

passed #768922
amd64 linux
unit:gcc:stretch:amd64

00:00:56

passed #768926
amd64 linux
unit:gcc:tumbleweed:amd64

00:00:56

passed #768928
amd64 linux
unit:gcc:xenial:amd64

00:01:01

skipped #768932
amd64 linux
unit:nocrypto:sid:amd64
passed #768936
amd64 linux
unit:nolibtool:sid:amd64

00:01:17

passed #768933
amd64 linux
unit:pkcs11:sid:amd64

00:01:04

 
  System
passed #768950
amd64 linux
system:asan:sid:amd64

00:09:54

passed #768953
amd64 libvirt
system:clang:freebsd11.3:amd64

00:10:21

failed #768954
amd64 libvirt
system:clang:freebsd12.1:amd64

00:11:16

passed #768937
amd64 linux
system:gcc:alpine3.11:amd64

00:08:01

failed #768949
amd64 linux
system:gcc:bionic:amd64

00:07:40

passed #768943
amd64 linux
system:gcc:buster:amd64

00:07:47

failed #768938
amd64 linux
system:gcc:centos6:amd64

00:08:02

failed #768939
amd64 linux
system:gcc:centos7:amd64

00:07:52

passed #768940
amd64 linux
system:gcc:centos8:amd64

00:07:37

passed #768947
amd64 linux
system:gcc:fedora31:amd64

00:07:51

failed #768941
amd64 linux
system:gcc:jessie:amd64

00:07:16

passed #768944
amd64 linux
system:gcc:sid:amd64

00:08:37

failed #768945
i386 linux
system:gcc:sid:i386

00:08:13

failed #768942
amd64 linux
system:gcc:stretch:amd64

00:07:46

failed #768946
amd64 linux
system:gcc:tumbleweed:amd64

00:08:04

passed #768948
amd64 linux
system:gcc:xenial:amd64

00:07:17

skipped #768951
amd64 linux
system:nocrypto:sid:amd64
failed #768955
amd64 linux
system:nolibtool:sid:amd64

00:09:33

passed #768952
amd64 linux
system:pkcs11:sid:amd64

00:08:22

 
  Docs
passed #768956
amd64 linux
docs:sid:amd64

00:01:09

 
  Postcheck
passed #768958
amd64 linux
cppcheck:gcc:sid:amd64

00:02:31

passed #768957
amd64 linux
scan-build:buster:amd64

00:11:28

 
Name Stage Failure
failed
system:clang:freebsd12.1:amd64 System
I:      dnssec
*** [test] Error code 1

make: stopped in /builds/isc-projects/bind9/bin/tests/system
Uploading artifacts...
Runtime platform arch=amd64 os=freebsd pid=50632 revision=1b659122 version=12.8.0
untracked: found 2422 files

Uploading artifacts to coordinator... ok
id=768954 responseStatus=201 Created token=tEtdKFCC
ERROR: Job failed: exit status 1
failed
system:gcc:sid:i386 System
I:      2 SKIPPED
I: 2 UNTESTED
I:The following system tests failed:
I: rpzrecurse
make: *** [Makefile:476: test] Error 1
Uploading artifacts...
untracked: found 2631 files
Uploading artifacts to coordinator... ok
id=768945 responseStatus=201 Created token=Vssynn2J
ERROR: Job failed: exit code 1
failed
system:nolibtool:sid:amd64 System
I:     88 PASS
I: 2 SKIPPED
I:The following system tests failed:
I: rpzrecurse
make: *** [Makefile:476: test] Error 1
Uploading artifacts...
untracked: found 2077 files
Uploading artifacts to coordinator... ok
id=768955 responseStatus=201 Created token=7yoy8ufm
ERROR: Job failed: exit code 1
failed
system:gcc:stretch:amd64 System
I:The following system tests failed:
I: autosign
I: rpzrecurse
make: *** [test] Error 1
Makefile:474: recipe for target 'test' failed
Uploading artifacts...
untracked: found 3121 files
Uploading artifacts to coordinator... ok
id=768942 responseStatus=201 Created token=oxqg7J1z
ERROR: Job failed: exit code 1
failed
system:gcc:bionic:amd64 System
I:The following system tests failed:
I: autosign
I: rpzrecurse
Makefile:474: recipe for target 'test' failed
make: *** [test] Error 1
Uploading artifacts...
untracked: found 3123 files
Uploading artifacts to coordinator... ok
id=768949 responseStatus=201 Created token=vLSfL8Uj
ERROR: Job failed: exit code 1
failed
system:gcc:centos7:amd64 System
I:     88 PASS
I: 3 SKIPPED
I:The following system tests failed:
I: rpzrecurse
make: *** [test] Error 1
Uploading artifacts...
untracked: found 2683 files
Uploading artifacts to coordinator... ok
id=768939 responseStatus=201 Created token=4VfmjFQx
ERROR: Job failed: exit code 1
failed
system:gcc:centos6:amd64 System
I:     87 PASS
I: 3 SKIPPED
I:The following system tests failed:
I: rpzrecurse
make: *** [test] Error 1
Uploading artifacts...
untracked: found 2672 files
Uploading artifacts to coordinator... ok
id=768938 responseStatus=201 Created token=wQzwzQhd
ERROR: Job failed: exit code 1
failed
system:gcc:tumbleweed:amd64 System
I:     88 PASS
I: 2 SKIPPED
I:The following system tests failed:
I: rpzrecurse
make: *** [Makefile:476: test] Error 1
Uploading artifacts...
untracked: found 2640 files
Uploading artifacts to coordinator... ok
id=768946 responseStatus=201 Created token=zXuG8cYE
ERROR: Job failed: exit code 1
failed
system:gcc:jessie:amd64 System
I:      3 SKIPPED
I:The following system tests failed:
I: rpzrecurse
Makefile:474: recipe for target 'test' failed
make: *** [test] Error 1
Uploading artifacts...
untracked: found 2402 files
Uploading artifacts to coordinator... ok
id=768941 responseStatus=201 Created token=PDeu-dAJ
ERROR: Job failed: exit code 1
failed
clang:stretch:amd64 Build
make[2]: Target 'all' not remade because of errors.
make[1]: *** [subdirs] Error 1
make[1]: Target 'all' not remade because of errors.
Makefile:82: recipe for target 'subdirs' failed
make[1]: Leaving directory '/builds/isc-projects/bind9/lib'
Makefile:88: recipe for target 'subdirs' failed
make: *** [subdirs] Error 1
make: Target 'all' not remade because of errors.
ERROR: Job failed: exit code 1