Add release note entry

76 jobs for !2124 with marka-update-per-type-record-limits in 25 minutes and 15 seconds (queued for 4 seconds)
detached
Status Job ID Name Coverage
  Precheck
passed #784660
amd64 linux
autoreconf

00:00:32

passed #784662
amd64 linux
clang-format

00:00:23

passed #784663
amd64 linux
coccinelle

00:04:01

failed #784661
amd64 linux
misc

00:00:30

 
  Build
passed #784679
amd64 linux
clang:asan

00:02:35

passed #784683
amd64 linux
clang:buster:amd64

00:01:53

passed #784685
amd64 libvirt
clang:freebsd11.3:amd64

00:01:51

passed #784686
amd64 libvirt
clang:freebsd12.1:amd64

00:01:44

passed #784687
amd64 libvirt
clang:openbsd6.6:amd64

00:05:00

passed #784681
amd64 linux
clang:tsan

00:02:20

passed #784664
amd64 linux
gcc:alpine3.11:amd64

00:02:23

passed #784678
amd64 linux
gcc:asan

00:02:05

passed #784677
amd64 linux
gcc:bionic:amd64

00:01:53

passed #784669
amd64 linux
gcc:buster:amd64

00:01:57

passed #784665
amd64 linux
gcc:centos6:amd64

00:02:15

passed #784666
amd64 linux
gcc:centos7:amd64

00:02:08

passed #784667
amd64 linux
gcc:centos8:amd64

00:02:28

passed #784675
amd64 linux
gcc:fedora31:amd64

00:02:03

passed #784670
amd64 linux
gcc:sid:amd64

00:01:48

passed #784672
arm64 linux
gcc:sid:arm64

00:07:39

passed #784673
i386 linux
gcc:sid:i386

00:01:43

passed #784668
amd64 linux
gcc:stretch:amd64

00:01:39

passed #784680
amd64 linux
gcc:tsan

00:02:09

passed #784674
amd64 linux
gcc:tumbleweed:amd64

00:02:14

passed #784676
amd64 linux
gcc:xenial:amd64

00:01:38

passed #784688
amd64 windows
msvc:windows:amd64

00:03:46

passed #784682
amd64 linux
mutexatomics

00:01:48

passed #784671
amd64 linux
out-of-tree

00:01:43

passed #784684
amd64 linux
pkcs11

00:01:56

 
  Unit
passed #784703
amd64 linux
unit:clang:asan

00:01:23

passed #784707
amd64 linux
unit:clang:buster:amd64

00:00:54

passed #784709
amd64 libvirt
unit:clang:freebsd11.3:amd64

00:01:04

passed #784710
amd64 libvirt
unit:clang:freebsd12.1:amd64

00:01:04

failed #784705
amd64 linux allowed to fail
unit:clang:tsan

00:02:29

passed #784689
amd64 linux
unit:gcc:alpine3.11:amd64

00:01:05

passed #784702
amd64 linux
unit:gcc:asan

00:01:17

passed #784701
amd64 linux
unit:gcc:bionic:amd64

00:00:54

passed #784694
amd64 linux
unit:gcc:buster:amd64

00:00:41

passed #784690
amd64 linux
unit:gcc:centos6:amd64

00:00:54

passed #784691
amd64 linux
unit:gcc:centos7:amd64

00:00:55

passed #784692
amd64 linux
unit:gcc:centos8:amd64

00:00:55

passed #784699
amd64 linux
unit:gcc:fedora31:amd64

00:00:59

passed #784695
amd64 linux
unit:gcc:sid:amd64

00:00:52

passed #784696
arm64 linux
unit:gcc:sid:arm64

00:01:41

passed #784697
i386 linux
unit:gcc:sid:i386

00:00:59

passed #784693
amd64 linux
unit:gcc:stretch:amd64

00:00:52

failed #784704
amd64 linux allowed to fail
unit:gcc:tsan

00:02:49

passed #784698
amd64 linux
unit:gcc:tumbleweed:amd64

00:00:50

passed #784700
amd64 linux
unit:gcc:xenial:amd64

00:00:54

passed #784706
amd64 linux
unit:mutexatomics

00:00:58

passed #784708
amd64 linux
unit:pkcs11

00:00:40

 
  System
passed #784725
amd64 linux
system:clang:asan

00:13:45

passed #784729
amd64 linux
system:clang:buster:amd64

00:11:22

passed #784731
amd64 libvirt
system:clang:freebsd11.3:amd64

00:13:08

passed #784732
amd64 libvirt
system:clang:freebsd12.1:amd64

00:12:48

failed #784727
amd64 linux allowed to fail
system:clang:tsan

00:15:48

passed #784711
amd64 linux
system:gcc:alpine3.11:amd64

00:12:14

passed #784724
amd64 linux
system:gcc:asan

00:13:50

passed #784723
amd64 linux
system:gcc:bionic:amd64

00:11:22

passed #784716
amd64 linux
system:gcc:buster:amd64

00:11:20

passed #784712
amd64 linux
system:gcc:centos6:amd64

00:11:46

passed #784713
amd64 linux
system:gcc:centos7:amd64

00:11:21

passed #784714
amd64 linux
system:gcc:centos8:amd64

00:11:38

passed #784721
amd64 linux
system:gcc:fedora31:amd64

00:11:53

passed #784717
amd64 linux
system:gcc:sid:amd64

00:11:28

passed #784718
arm64 linux
system:gcc:sid:arm64

00:13:09

passed #784719
i386 linux
system:gcc:sid:i386

00:12:49

passed #784715
amd64 linux
system:gcc:stretch:amd64

00:11:21

failed #784726
amd64 linux allowed to fail
system:gcc:tsan

00:17:12

passed #784720
amd64 linux
system:gcc:tumbleweed:amd64

00:11:49

passed #784722
amd64 linux
system:gcc:xenial:amd64

00:10:26

passed #784728
amd64 linux
system:mutexatomics

00:12:40

passed #784730
amd64 linux
system:pkcs11

00:12:28

 
  Docs
failed #784733
amd64 linux
docs

00:00:39

 
  Postcheck
passed #784735
amd64 linux
cppcheck

00:00:42

passed #784734
amd64 linux
scan-build

00:13:30

 
Name Stage Failure
failed
system:gcc:tsan System
make: *** [Makefile:441: test] Error 1
Running after script...
$ find bin -name 'tsan.*' -exec python3 util/parse_tsan.py {} \;
Uploading artifacts...
bin/tests/system/*/tsan.*: found 18 matching files
bin/tests/system/*/*/tsan.*: found 243 matching files

tsan/: found 218 matching files

Uploading artifacts to coordinator... ok
id=784726 responseStatus=201 Created token=TvcyLqia
ERROR: Job failed: exit code 1
failed
system:clang:tsan System
make: *** [Makefile:441: test] Error 1
Running after script...
$ find bin -name 'tsan.*' -exec python3 util/parse_tsan.py {} \;
Uploading artifacts...
bin/tests/system/*/tsan.*: found 18 matching files
bin/tests/system/*/*/tsan.*: found 251 matching files

tsan/: found 200 matching files

Uploading artifacts to coordinator... ok
id=784727 responseStatus=201 Created token=s3iibwws
ERROR: Job failed: exit code 1
failed
docs Docs
<<<<<<< HEAD
^
notes-9.17.0.xml:18: parser error : StartTag: invalid element name
<<<<<<< HEAD
^
-:21585: element include: XInclude error : could not load notes-9.17.0.xml, and no fallback was found
make: Leaving directory '/builds/isc-projects/bind9/doc/arm'
make: *** [Makefile:398: Bv9ARM.html] Error 6
ERROR: Job failed: exit code 1
failed
unit:gcc:tsan Unit
$ find lib -name 'tsan.*' -exec python3 util/parse_tsan.py {} \;
Uploading artifacts...
WARNING: lib/*/tests/tsan.*: no matching files
WARNING: tsan/: no matching files
kyua.log: found 1 matching files

kyua.results: found 1 matching files

WARNING: kyua_html/: no matching files
Uploading artifacts to coordinator... ok
id=784704 responseStatus=201 Created token=cdpzMJUM
ERROR: Job failed: exit code 1
failed
unit:clang:tsan Unit
$ find lib -name 'tsan.*' -exec python3 util/parse_tsan.py {} \;
Uploading artifacts...
WARNING: lib/*/tests/tsan.*: no matching files
WARNING: tsan/: no matching files
kyua.log: found 1 matching files

kyua.results: found 1 matching files

WARNING: kyua_html/: no matching files
Uploading artifacts to coordinator... ok
id=784705 responseStatus=201 Created token=xvYieb8T
ERROR: Job failed: exit code 1
failed
misc Precheck
      ^
doc/arm/notes-9.17.0.xml:18: parser error : StartTag: invalid element name
<<<<<<< HEAD
^
Uploading artifacts...
WARNING: util/newcopyrights: no matching files
checklibs.out: found 1 matching files

Uploading artifacts to coordinator... ok
id=784661 responseStatus=201 Created token=DPSj2pJ-
ERROR: Job failed: exit code 1