Test use-dns64 by simulation connecting to a IPv4 only server through a NAT64.

Status Job ID Name Coverage
  Precheck
passed #787938
amd64 linux
autoreconf

00:00:32

failed #787940
amd64 linux
clang-format

00:00:19

passed #787941
amd64 linux
coccinelle

00:03:55

passed #787939
amd64 linux
misc

00:00:16

 
  Build
passed #787957
amd64 linux
clang:asan

00:03:15

passed #787961
amd64 linux
clang:buster:amd64

00:01:24

passed #787963
amd64 libvirt
clang:freebsd11.3:amd64

00:01:52

passed #787964
amd64 libvirt
clang:freebsd12.1:amd64

00:01:43

passed #787965
amd64 libvirt
clang:openbsd6.6:amd64

00:05:22

passed #787959
amd64 linux
clang:tsan

00:03:12

passed #787942
amd64 linux
gcc:alpine3.11:amd64

00:02:58

passed #787956
amd64 linux
gcc:asan

00:02:53

passed #787955
amd64 linux
gcc:bionic:amd64

00:01:58

passed #787947
amd64 linux
gcc:buster:amd64

00:01:54

passed #787943
amd64 linux
gcc:centos6:amd64

00:02:42

passed #787944
amd64 linux
gcc:centos7:amd64

00:02:11

passed #787945
amd64 linux
gcc:centos8:amd64

00:02:56

passed #787953
amd64 linux
gcc:fedora31:amd64

00:02:52

passed #787960
amd64 linux
gcc:mutexatomics

00:02:01

passed #787949
amd64 linux
gcc:out-of-tree

00:02:03

passed #787962
amd64 linux
gcc:pkcs11

00:01:37

passed #787948
amd64 linux
gcc:sid:amd64

00:02:14

failed #787950
arm64 linux
gcc:sid:arm64

passed #787951
i386 linux
gcc:sid:i386

00:02:32

passed #787946
amd64 linux
gcc:stretch:amd64

00:02:03

passed #787958
amd64 linux
gcc:tsan

00:02:16

passed #787952
amd64 linux
gcc:tumbleweed:amd64

00:02:17

passed #787954
amd64 linux
gcc:xenial:amd64

00:02:34

passed #787966
amd64 windows
msvc:windows:amd64

00:02:45

 
  Unit
passed #787981
amd64 linux
unit:clang:asan

00:01:05

passed #787985
amd64 linux
unit:clang:buster:amd64

00:00:39

passed #787987
amd64 libvirt
unit:clang:freebsd11.3:amd64

00:01:03

passed #787988
amd64 libvirt
unit:clang:freebsd12.1:amd64

00:00:57

failed #787983
amd64 linux allowed to fail
unit:clang:tsan

00:00:48

passed #787967
amd64 linux
unit:gcc:alpine3.11:amd64

00:01:06

passed #787980
amd64 linux
unit:gcc:asan

00:01:00

passed #787979
amd64 linux
unit:gcc:bionic:amd64

00:00:49

passed #787972
amd64 linux
unit:gcc:buster:amd64

00:00:42

passed #787968
amd64 linux
unit:gcc:centos6:amd64

00:00:45

passed #787969
amd64 linux
unit:gcc:centos7:amd64

00:00:47

passed #787970
amd64 linux
unit:gcc:centos8:amd64

00:00:45

passed #787977
amd64 linux
unit:gcc:fedora31:amd64

00:01:00

passed #787984
amd64 linux
unit:gcc:mutexatomics

00:00:51

passed #787986
amd64 linux
unit:gcc:pkcs11

00:00:50

passed #787973
amd64 linux
unit:gcc:sid:amd64

00:00:53

skipped #787974
arm64 linux
unit:gcc:sid:arm64
passed #787975
i386 linux
unit:gcc:sid:i386

00:00:58

passed #787971
amd64 linux
unit:gcc:stretch:amd64

00:00:45

failed #787982
amd64 linux allowed to fail
unit:gcc:tsan

00:02:50

passed #787976
amd64 linux
unit:gcc:tumbleweed:amd64

00:00:52

passed #787978
amd64 linux
unit:gcc:xenial:amd64

00:00:45

 
  System
passed #788003
amd64 linux
system:clang:asan

00:12:40

passed #788007
amd64 linux
system:clang:buster:amd64

00:11:23

passed #788009
amd64 libvirt
system:clang:freebsd11.3:amd64

00:12:21

failed #788010
amd64 libvirt
system:clang:freebsd12.1:amd64

00:13:06

failed #788005
amd64 linux allowed to fail
system:clang:tsan

00:06:42

passed #787989
amd64 linux
system:gcc:alpine3.11:amd64

00:11:41

passed #788002
amd64 linux
system:gcc:asan

00:13:47

passed #788001
amd64 linux
system:gcc:bionic:amd64

00:12:06

passed #787994
amd64 linux
system:gcc:buster:amd64

00:10:12

passed #787990
amd64 linux
system:gcc:centos6:amd64

00:10:54

passed #787991
amd64 linux
system:gcc:centos7:amd64

00:10:27

passed #787992
amd64 linux
system:gcc:centos8:amd64

00:11:43

passed #787999
amd64 linux
system:gcc:fedora31:amd64

00:11:29

passed #788006
amd64 linux
system:gcc:mutexatomics

00:10:57

passed #788008
amd64 linux
system:gcc:pkcs11

00:12:05

passed #787995
amd64 linux
system:gcc:sid:amd64

00:11:31

skipped #787996
arm64 linux
system:gcc:sid:arm64
passed #787997
i386 linux
system:gcc:sid:i386

00:11:41

passed #787993
amd64 linux
system:gcc:stretch:amd64

00:09:54

failed #788004
amd64 linux allowed to fail
system:gcc:tsan

00:17:00

passed #787998
amd64 linux
system:gcc:tumbleweed:amd64

00:11:07

passed #788000
amd64 linux
system:gcc:xenial:amd64

00:11:18

 
  Docs
passed #788011
amd64 linux
docs

00:00:35

 
  Postcheck
passed #788013
amd64 linux
cppcheck

00:00:29

passed #788012
amd64 linux
scan-build

00:10:59

 
Name Stage Failure
failed
gcc:sid:arm64 Build There has been a timeout failure or the job got stuck. Check your timeout limits or try again
No job log
failed
system:clang:freebsd12.1:amd64 System
I:      dnstap
*** [test] Error code 1

make: stopped in /builds/isc-projects/bind9/bin/tests/system
Uploading artifacts...
Runtime platform arch=amd64 os=freebsd pid=22581 revision=4c96e5ad version=12.9.0
untracked: found 1367 files

Uploading artifacts to coordinator... ok
id=788010 responseStatus=201 Created token=gCg4UUbN
ERROR: Job failed: exit status 1
failed
system:gcc:tsan System
make: *** [Makefile:441: test] Error 1
Running after script...
$ find bin -name 'tsan.*' -exec python3 util/parse_tsan.py {} \;
Uploading artifacts...
bin/tests/system/*/tsan.*: found 18 matching files
bin/tests/system/*/*/tsan.*: found 250 matching files

tsan/: found 212 matching files

Uploading artifacts to coordinator... ok
id=788004 responseStatus=201 Created token=GsDnxwrU
ERROR: Job failed: exit code 1
failed
system:clang:tsan System
make: *** [Makefile:441: test] Error 1
Running after script...
$ find bin -name 'tsan.*' -exec python3 util/parse_tsan.py {} \;
Uploading artifacts...
bin/tests/system/*/tsan.*: found 640 matching files
bin/tests/system/*/*/tsan.*: found 550 matching files

tsan/: found 1 matching files

Uploading artifacts to coordinator... ok
id=788005 responseStatus=201 Created token=LoJuZZT_
ERROR: Job failed: exit code 1
failed
unit:gcc:tsan Unit
$ find lib -name 'tsan.*' -exec python3 util/parse_tsan.py {} \;
Uploading artifacts...
WARNING: lib/*/tests/tsan.*: no matching files
WARNING: tsan/: no matching files
kyua.log: found 1 matching files

kyua.results: found 1 matching files

kyua_html/: found 69 matching files

Uploading artifacts to coordinator... ok
id=787982 responseStatus=201 Created token=akezsc_D
ERROR: Job failed: exit code 1
failed
unit:clang:tsan Unit
$ find lib -name 'tsan.*' -exec python3 util/parse_tsan.py {} \;
Uploading artifacts...
WARNING: lib/*/tests/tsan.*: no matching files
WARNING: tsan/: no matching files
kyua.log: found 1 matching files

kyua.results: found 1 matching files

kyua_html/: found 69 matching files

Uploading artifacts to coordinator... ok
id=787983 responseStatus=201 Created token=hM6dKNeN
ERROR: Job failed: exit code 1
failed
clang-format Precheck
Removing unit/unittest.sh
Removing util/check-make-install

Skipping Git submodules setup
Authenticating with credentials from $DOCKER_AUTH_CONFIG
$ if [ -r .clang-format ]; then "${CLANG_FORMAT}" -i -style=file $(git ls-files '*.c' '*.h'); fi
$ if test "$(git status --porcelain | grep -Ev '\?\?' | wc -l)" -gt "0"; then git status --short; exit 1; fi
M lib/dns/dns64.c
ERROR: Job failed: exit code 1