accept gc._msdcs.<forest> as a reverse PTR target with checknames enabled

Status Job ID Name Coverage
  Precheck
passed #788014
amd64 linux
autoreconf

00:00:31

passed #788016
amd64 linux
clang-format

00:00:20

passed #788017
amd64 linux
coccinelle

00:03:42

passed #788015
amd64 linux
misc

00:00:20

 
  Build
passed #788033
amd64 linux
clang:asan

00:02:02

passed #788037
amd64 linux
clang:buster:amd64

00:01:42

passed #788039
amd64 libvirt
clang:freebsd11.3:amd64

00:01:52

passed #788040
amd64 libvirt
clang:freebsd12.1:amd64

00:02:21

passed #788041
amd64 libvirt
clang:openbsd6.6:amd64

00:05:51

passed #788035
amd64 linux
clang:tsan

00:01:56

passed #788018
amd64 linux
gcc:alpine3.11:amd64

00:02:07

passed #788032
amd64 linux
gcc:asan

00:01:52

passed #788031
amd64 linux
gcc:bionic:amd64

00:01:35

passed #788023
amd64 linux
gcc:buster:amd64

00:01:28

passed #788019
amd64 linux
gcc:centos6:amd64

00:02:09

passed #788020
amd64 linux
gcc:centos7:amd64

00:02:17

passed #788021
amd64 linux
gcc:centos8:amd64

00:02:08

passed #788029
amd64 linux
gcc:fedora31:amd64

00:01:56

passed #788036
amd64 linux
gcc:mutexatomics

00:01:17

passed #788025
amd64 linux
gcc:out-of-tree

00:01:51

passed #788038
amd64 linux
gcc:pkcs11

00:01:27

passed #788024
amd64 linux
gcc:sid:amd64

00:01:49

failed #788026
arm64 linux
gcc:sid:arm64

passed #788027
i386 linux
gcc:sid:i386

00:01:27

passed #788022
amd64 linux
gcc:stretch:amd64

00:01:15

passed #788034
amd64 linux
gcc:tsan

00:01:45

passed #788028
amd64 linux
gcc:tumbleweed:amd64

00:02:02

passed #788030
amd64 linux
gcc:xenial:amd64

00:01:28

passed #788042
amd64 windows
msvc:windows:amd64

00:02:35

 
  Unit
passed #788057
amd64 linux
unit:clang:asan

00:01:08

passed #788061
amd64 linux
unit:clang:buster:amd64

00:00:52

passed #788063
amd64 libvirt
unit:clang:freebsd11.3:amd64

00:00:56

failed #788064
amd64 libvirt
unit:clang:freebsd12.1:amd64

00:05:59

failed #788059
amd64 linux allowed to fail
unit:clang:tsan

00:00:47

passed #788043
amd64 linux
unit:gcc:alpine3.11:amd64

00:01:01

passed #788056
amd64 linux
unit:gcc:asan

00:00:58

passed #788055
amd64 linux
unit:gcc:bionic:amd64

00:00:51

passed #788048
amd64 linux
unit:gcc:buster:amd64

00:00:49

passed #788044
amd64 linux
unit:gcc:centos6:amd64

00:00:52

passed #788045
amd64 linux
unit:gcc:centos7:amd64

00:00:42

passed #788046
amd64 linux
unit:gcc:centos8:amd64

00:00:52

passed #788053
amd64 linux
unit:gcc:fedora31:amd64

00:00:53

passed #788060
amd64 linux
unit:gcc:mutexatomics

00:00:52

passed #788062
amd64 linux
unit:gcc:pkcs11

00:00:52

passed #788049
amd64 linux
unit:gcc:sid:amd64

00:00:51

skipped #788050
arm64 linux
unit:gcc:sid:arm64
passed #788051
i386 linux
unit:gcc:sid:i386

00:01:00

passed #788047
amd64 linux
unit:gcc:stretch:amd64

00:00:53

failed #788058
amd64 linux allowed to fail
unit:gcc:tsan

00:02:35

passed #788052
amd64 linux
unit:gcc:tumbleweed:amd64

00:00:51

passed #788054
amd64 linux
unit:gcc:xenial:amd64

00:00:50

 
  System
passed #788079
amd64 linux
system:clang:asan

00:12:43

passed #788083
amd64 linux
system:clang:buster:amd64

00:11:17

passed #788085
amd64 libvirt
system:clang:freebsd11.3:amd64

00:12:34

passed #788086
amd64 libvirt
system:clang:freebsd12.1:amd64

00:12:42

failed #788081
amd64 linux allowed to fail
system:clang:tsan

00:06:20

passed #788065
amd64 linux
system:gcc:alpine3.11:amd64

00:11:11

passed #788078
amd64 linux
system:gcc:asan

00:12:19

passed #788077
amd64 linux
system:gcc:bionic:amd64

00:10:43

passed #788070
amd64 linux
system:gcc:buster:amd64

00:09:54

passed #788066
amd64 linux
system:gcc:centos6:amd64

00:11:18

passed #788067
amd64 linux
system:gcc:centos7:amd64

00:11:10

passed #788068
amd64 linux
system:gcc:centos8:amd64

00:11:04

passed #788075
amd64 linux
system:gcc:fedora31:amd64

00:11:20

failed #788082
amd64 linux
system:gcc:mutexatomics

00:11:33

passed #788084
amd64 linux
system:gcc:pkcs11

00:11:40

passed #788071
amd64 linux
system:gcc:sid:amd64

00:10:21

skipped #788072
arm64 linux
system:gcc:sid:arm64
passed #788073
i386 linux
system:gcc:sid:i386

00:11:43

passed #788069
amd64 linux
system:gcc:stretch:amd64

00:12:04

failed #788080
amd64 linux allowed to fail
system:gcc:tsan

00:16:14

passed #788074
amd64 linux
system:gcc:tumbleweed:amd64

00:11:49

passed #788076
amd64 linux
system:gcc:xenial:amd64

00:10:32

 
  Docs
passed #788087
amd64 linux
docs

00:00:28

 
  Postcheck
passed #788089
amd64 linux
cppcheck

00:00:29

passed #788088
amd64 linux
scan-build

00:10:44

 
Name Stage Failure
failed
gcc:sid:arm64 Build There has been a timeout failure or the job got stuck. Check your timeout limits or try again
No job log
failed
system:gcc:tsan System
make: *** [Makefile:441: test] Error 1
Running after script...
$ find bin -name 'tsan.*' -exec python3 util/parse_tsan.py {} \;
Uploading artifacts...
bin/tests/system/*/tsan.*: found 18 matching files
bin/tests/system/*/*/tsan.*: found 251 matching files

tsan/: found 212 matching files

Uploading artifacts to coordinator... ok
id=788080 responseStatus=201 Created token=f8PVcfQC
ERROR: Job failed: exit code 1
failed
system:gcc:mutexatomics System
I:The following system tests failed:
I: legacy
I:Core dumps were found for the following system tests:
I: legacy
make: *** [Makefile:441: test] Error 1
Uploading artifacts...
untracked: found 1392 files
Uploading artifacts to coordinator... ok
id=788082 responseStatus=201 Created token=Qf1Jj8qY
ERROR: Job failed: exit code 1
failed
unit:clang:freebsd12.1:amd64 Unit
Generating kyua_html/lib_ns_tests_plugin_test_main.html
Generating kyua_html/lib_ns_tests_query_test_main.html
Generating kyua_html/report.css
Generating kyua_html/index.html
Uploading artifacts...
Runtime platform arch=amd64 os=freebsd pid=1810 revision=4c96e5ad version=12.9.0
untracked: found 1374 files

Uploading artifacts to coordinator... ok
id=788064 responseStatus=201 Created token=nyfE2pgj
ERROR: Job failed: exit status 1
failed
system:clang:tsan System
make: *** [Makefile:441: test] Error 1
Running after script...
$ find bin -name 'tsan.*' -exec python3 util/parse_tsan.py {} \;
Uploading artifacts...
bin/tests/system/*/tsan.*: found 640 matching files
bin/tests/system/*/*/tsan.*: found 550 matching files

tsan/: found 1 matching files

Uploading artifacts to coordinator... ok
id=788081 responseStatus=201 Created token=JqVtVwuK
ERROR: Job failed: exit code 1
failed
unit:gcc:tsan Unit
$ find lib -name 'tsan.*' -exec python3 util/parse_tsan.py {} \;
Uploading artifacts...
WARNING: lib/*/tests/tsan.*: no matching files
WARNING: tsan/: no matching files
kyua.log: found 1 matching files

kyua.results: found 1 matching files

kyua_html/: found 69 matching files

Uploading artifacts to coordinator... ok
id=788058 responseStatus=201 Created token=D-VXLKP3
ERROR: Job failed: exit code 1
failed
unit:clang:tsan Unit
$ find lib -name 'tsan.*' -exec python3 util/parse_tsan.py {} \;
Uploading artifacts...
WARNING: lib/*/tests/tsan.*: no matching files
WARNING: tsan/: no matching files
kyua.log: found 1 matching files

kyua.results: found 1 matching files

kyua_html/: found 69 matching files

Uploading artifacts to coordinator... ok
id=788059 responseStatus=201 Created token=GY11QREJ
ERROR: Job failed: exit code 1