also log the error path

Status Job ID Name Coverage
  Precheck
passed #788166
amd64 linux
autoreconf

00:00:32

passed #788168
amd64 linux
clang-format

00:00:22

passed #788169
amd64 linux
coccinelle

00:03:56

passed #788167
amd64 linux
misc

00:00:18

 
  Build
passed #788185
amd64 linux
clang:asan

00:03:06

passed #788189
amd64 linux
clang:buster:amd64

00:01:49

passed #788191
amd64 libvirt
clang:freebsd11.3:amd64

00:01:53

passed #788192
amd64 libvirt
clang:freebsd12.1:amd64

00:01:54

passed #788193
amd64 libvirt
clang:openbsd6.6:amd64

00:05:45

passed #788187
amd64 linux
clang:tsan

00:02:06

passed #788170
amd64 linux
gcc:alpine3.11:amd64

00:02:23

passed #788184
amd64 linux
gcc:asan

00:02:05

passed #788183
amd64 linux
gcc:bionic:amd64

00:02:05

passed #788175
amd64 linux
gcc:buster:amd64

00:01:45

passed #788171
amd64 linux
gcc:centos6:amd64

00:02:08

passed #788172
amd64 linux
gcc:centos7:amd64

00:02:02

passed #788173
amd64 linux
gcc:centos8:amd64

00:02:13

passed #788181
amd64 linux
gcc:fedora31:amd64

00:02:08

passed #788188
amd64 linux
gcc:mutexatomics

00:01:45

passed #788177
amd64 linux
gcc:out-of-tree

00:01:54

passed #788190
amd64 linux
gcc:pkcs11

00:01:47

passed #788176
amd64 linux
gcc:sid:amd64

00:02:05

failed #788178
arm64 linux
gcc:sid:arm64

passed #788179
i386 linux
gcc:sid:i386

00:01:31

passed #788174
amd64 linux
gcc:stretch:amd64

00:01:45

passed #788186
amd64 linux
gcc:tsan

00:01:57

passed #788180
amd64 linux
gcc:tumbleweed:amd64

00:02:01

passed #788182
amd64 linux
gcc:xenial:amd64

00:01:43

passed #788194
amd64 windows
msvc:windows:amd64

00:02:33

 
  Unit
passed #788209
amd64 linux
unit:clang:asan

00:01:11

passed #788213
amd64 linux
unit:clang:buster:amd64

00:00:56

passed #788215
amd64 libvirt
unit:clang:freebsd11.3:amd64

00:01:06

passed #788216
amd64 libvirt
unit:clang:freebsd12.1:amd64

00:01:00

failed #788211
amd64 linux allowed to fail
unit:clang:tsan

00:00:51

passed #788195
amd64 linux
unit:gcc:alpine3.11:amd64

00:00:59

passed #788208
amd64 linux
unit:gcc:asan

00:01:05

passed #788207
amd64 linux
unit:gcc:bionic:amd64

00:00:50

passed #788200
amd64 linux
unit:gcc:buster:amd64

00:00:53

passed #788196
amd64 linux
unit:gcc:centos6:amd64

00:00:42

passed #788197
amd64 linux
unit:gcc:centos7:amd64

00:00:56

passed #788198
amd64 linux
unit:gcc:centos8:amd64

00:00:55

passed #788205
amd64 linux
unit:gcc:fedora31:amd64

00:00:44

passed #788212
amd64 linux
unit:gcc:mutexatomics

00:00:41

passed #788214
amd64 linux
unit:gcc:pkcs11

00:00:54

passed #788201
amd64 linux
unit:gcc:sid:amd64

00:00:40

skipped #788202
arm64 linux
unit:gcc:sid:arm64
passed #788203
i386 linux
unit:gcc:sid:i386

00:01:02

passed #788199
amd64 linux
unit:gcc:stretch:amd64

00:00:51

failed #788210
amd64 linux allowed to fail
unit:gcc:tsan

00:02:37

passed #788204
amd64 linux
unit:gcc:tumbleweed:amd64

00:00:51

passed #788206
amd64 linux
unit:gcc:xenial:amd64

00:00:46

 
  System
passed #788231
amd64 linux
system:clang:asan

00:12:49

passed #788235
amd64 linux
system:clang:buster:amd64

00:10:55

passed #788237
amd64 libvirt
system:clang:freebsd11.3:amd64

00:12:35

failed #788238
amd64 libvirt
system:clang:freebsd12.1:amd64

00:12:56

failed #788233
amd64 linux allowed to fail
system:clang:tsan

00:06:39

passed #788217
amd64 linux
system:gcc:alpine3.11:amd64

00:11:23

passed #788230
amd64 linux
system:gcc:asan

00:12:53

passed #788229
amd64 linux
system:gcc:bionic:amd64

00:11:57

passed #788222
amd64 linux
system:gcc:buster:amd64

00:10:22

failed #788218
amd64 linux
system:gcc:centos6:amd64

00:10:50

failed #788219
amd64 linux
system:gcc:centos7:amd64

00:10:51

passed #788220
amd64 linux
system:gcc:centos8:amd64

00:11:55

passed #788227
amd64 linux
system:gcc:fedora31:amd64

00:10:41

passed #788234
amd64 linux
system:gcc:mutexatomics

00:10:05

passed #788236
amd64 linux
system:gcc:pkcs11

00:11:49

passed #788223
amd64 linux
system:gcc:sid:amd64

00:10:28

skipped #788224
arm64 linux
system:gcc:sid:arm64
passed #788225
i386 linux
system:gcc:sid:i386

00:10:49

passed #788221
amd64 linux
system:gcc:stretch:amd64

00:09:47

failed #788232
amd64 linux allowed to fail
system:gcc:tsan

00:15:32

passed #788226
amd64 linux
system:gcc:tumbleweed:amd64

00:11:45

passed #788228
amd64 linux
system:gcc:xenial:amd64

00:11:25

 
  Docs
passed #788239
amd64 linux
docs

00:00:37

 
  Postcheck
passed #788241
amd64 linux
cppcheck

00:00:28

passed #788240
amd64 linux
scan-build

00:10:42

 
Name Stage Failure
failed
gcc:sid:arm64 Build There has been a timeout failure or the job got stuck. Check your timeout limits or try again
No job log
failed
system:clang:freebsd12.1:amd64 System
I:      dnstap
*** [test] Error code 1

make: stopped in /builds/isc-projects/bind9/bin/tests/system
Uploading artifacts...
Runtime platform arch=amd64 os=freebsd pid=22518 revision=4c96e5ad version=12.9.0
untracked: found 1367 files

Uploading artifacts to coordinator... ok
id=788238 responseStatus=201 Created token=VbSqB5Pr
ERROR: Job failed: exit status 1
failed
system:gcc:tsan System
make: *** [Makefile:441: test] Error 1
Running after script...
$ find bin -name 'tsan.*' -exec python3 util/parse_tsan.py {} \;
Uploading artifacts...
bin/tests/system/*/tsan.*: found 18 matching files
bin/tests/system/*/*/tsan.*: found 248 matching files

tsan/: found 226 matching files

Uploading artifacts to coordinator... ok
id=788232 responseStatus=201 Created token=Np7x6PzF
ERROR: Job failed: exit code 1
failed
system:gcc:centos7:amd64 System
I:     98 PASS
I: 1 UNTESTED
I:The following system tests failed:
I: qmin
make: *** [test] Error 1
Uploading artifacts...
untracked: found 1436 files
Uploading artifacts to coordinator... ok
id=788219 responseStatus=201 Created token=FEEBQSAp
ERROR: Job failed: exit code 1
failed
system:gcc:centos6:amd64 System
I:     97 PASS
I: 1 UNTESTED
I:The following system tests failed:
I: kasp
make: *** [test] Error 1
Uploading artifacts...
untracked: found 3129 files
Uploading artifacts to coordinator... ok
id=788218 responseStatus=201 Created token=dSJYUZqV
ERROR: Job failed: exit code 1
failed
system:clang:tsan System
make: *** [Makefile:441: test] Error 1
Running after script...
$ find bin -name 'tsan.*' -exec python3 util/parse_tsan.py {} \;
Uploading artifacts...
bin/tests/system/*/tsan.*: found 640 matching files
bin/tests/system/*/*/tsan.*: found 550 matching files

tsan/: found 1 matching files

Uploading artifacts to coordinator... ok
id=788233 responseStatus=201 Created token=xeeYCKpw
ERROR: Job failed: exit code 1
failed
unit:gcc:tsan Unit
$ find lib -name 'tsan.*' -exec python3 util/parse_tsan.py {} \;
Uploading artifacts...
WARNING: lib/*/tests/tsan.*: no matching files
WARNING: tsan/: no matching files
kyua.log: found 1 matching files

kyua.results: found 1 matching files

kyua_html/: found 69 matching files

Uploading artifacts to coordinator... ok
id=788210 responseStatus=201 Created token=puT43GY8
ERROR: Job failed: exit code 1
failed
unit:clang:tsan Unit
$ find lib -name 'tsan.*' -exec python3 util/parse_tsan.py {} \;
Uploading artifacts...
WARNING: lib/*/tests/tsan.*: no matching files
WARNING: tsan/: no matching files
kyua.log: found 1 matching files

kyua.results: found 1 matching files

kyua_html/: found 69 matching files

Uploading artifacts to coordinator... ok
id=788211 responseStatus=201 Created token=qExR_xtr
ERROR: Job failed: exit code 1