extend add-new tests

Status Job ID Name Coverage
  Precheck
passed #788335
amd64 linux
autoreconf

00:00:33

passed #788337
amd64 linux
clang-format

00:00:22

passed #788338
amd64 linux
coccinelle

00:04:11

passed #788336
amd64 linux
misc

00:00:16

 
  Build
passed #788354
amd64 linux
clang:asan

00:02:48

passed #788358
amd64 linux
clang:buster:amd64

00:02:12

passed #788360
amd64 libvirt
clang:freebsd11.3:amd64

00:02:37

passed #788361
amd64 libvirt
clang:freebsd12.1:amd64

00:02:40

passed #788362
amd64 libvirt
clang:openbsd6.6:amd64

00:05:47

passed #788356
amd64 linux
clang:tsan

00:02:31

passed #788339
amd64 linux
gcc:alpine3.11:amd64

00:02:30

passed #788353
amd64 linux
gcc:asan

00:04:27

passed #788352
amd64 linux
gcc:bionic:amd64

00:01:44

passed #788344
amd64 linux
gcc:buster:amd64

00:01:42

passed #788340
amd64 linux
gcc:centos6:amd64

00:02:12

passed #788341
amd64 linux
gcc:centos7:amd64

00:02:20

passed #788342
amd64 linux
gcc:centos8:amd64

00:02:26

passed #788350
amd64 linux
gcc:fedora31:amd64

00:02:27

passed #788357
amd64 linux
gcc:mutexatomics

00:02:06

passed #788346
amd64 linux
gcc:out-of-tree

00:02:17

passed #788359
amd64 linux
gcc:pkcs11

00:02:05

passed #788345
amd64 linux
gcc:sid:amd64

00:01:54

failed #788347
arm64 linux
gcc:sid:arm64

passed #788348
i386 linux
gcc:sid:i386

00:02:11

passed #788343
amd64 linux
gcc:stretch:amd64

00:01:47

passed #788355
amd64 linux
gcc:tsan

00:01:57

passed #788349
amd64 linux
gcc:tumbleweed:amd64

00:02:23

passed #788351
amd64 linux
gcc:xenial:amd64

00:01:44

passed #788363
amd64 windows
msvc:windows:amd64

00:02:36

 
  Unit
passed #788378
amd64 linux
unit:clang:asan

00:01:17

passed #788382
amd64 linux
unit:clang:buster:amd64

00:00:39

passed #788384
amd64 libvirt
unit:clang:freebsd11.3:amd64

00:01:05

passed #788385
amd64 libvirt
unit:clang:freebsd12.1:amd64

00:01:13

failed #788380
amd64 linux allowed to fail
unit:clang:tsan

00:00:48

passed #788364
amd64 linux
unit:gcc:alpine3.11:amd64

00:00:58

passed #788377
amd64 linux
unit:gcc:asan

00:01:27

passed #788376
amd64 linux
unit:gcc:bionic:amd64

00:00:44

passed #788369
amd64 linux
unit:gcc:buster:amd64

00:00:52

passed #788365
amd64 linux
unit:gcc:centos6:amd64

00:00:51

passed #788366
amd64 linux
unit:gcc:centos7:amd64

00:00:57

passed #788367
amd64 linux
unit:gcc:centos8:amd64

00:00:54

passed #788374
amd64 linux
unit:gcc:fedora31:amd64

00:00:40

passed #788381
amd64 linux
unit:gcc:mutexatomics

00:00:59

passed #788383
amd64 linux
unit:gcc:pkcs11

00:01:01

passed #788370
amd64 linux
unit:gcc:sid:amd64

00:00:52

skipped #788371
arm64 linux
unit:gcc:sid:arm64
passed #788372
i386 linux
unit:gcc:sid:i386

00:01:07

passed #788368
amd64 linux
unit:gcc:stretch:amd64

00:00:45

failed #788379
amd64 linux allowed to fail
unit:gcc:tsan

00:02:53

passed #788373
amd64 linux
unit:gcc:tumbleweed:amd64

00:00:56

passed #788375
amd64 linux
unit:gcc:xenial:amd64

00:00:53

 
  System
passed #788400
amd64 linux
system:clang:asan

00:13:41

passed #788404
amd64 linux
system:clang:buster:amd64

00:10:17

passed #788406
amd64 libvirt
system:clang:freebsd11.3:amd64

00:12:56

failed #788407
amd64 libvirt
system:clang:freebsd12.1:amd64

00:13:21

failed #788402
amd64 linux allowed to fail
system:clang:tsan

00:06:18

passed #788386
amd64 linux
system:gcc:alpine3.11:amd64

00:12:09

passed #788399
amd64 linux
system:gcc:asan

00:12:21

passed #788398
amd64 linux
system:gcc:bionic:amd64

00:09:42

passed #788391
amd64 linux
system:gcc:buster:amd64

00:12:11

passed #788387
amd64 linux
system:gcc:centos6:amd64

00:10:23

passed #788388
amd64 linux
system:gcc:centos7:amd64

00:10:09

passed #788389
amd64 linux
system:gcc:centos8:amd64

00:11:17

passed #788396
amd64 linux
system:gcc:fedora31:amd64

00:11:52

passed #788403
amd64 linux
system:gcc:mutexatomics

00:11:40

passed #788405
amd64 linux
system:gcc:pkcs11

00:12:07

passed #788392
amd64 linux
system:gcc:sid:amd64

00:10:07

skipped #788393
arm64 linux
system:gcc:sid:arm64
passed #788394
i386 linux
system:gcc:sid:i386

00:12:09

passed #788390
amd64 linux
system:gcc:stretch:amd64

00:09:23

failed #788401
amd64 linux allowed to fail
system:gcc:tsan

00:16:24

passed #788395
amd64 linux
system:gcc:tumbleweed:amd64

00:10:22

passed #788397
amd64 linux
system:gcc:xenial:amd64

00:11:29

 
  Docs
passed #788408
amd64 linux
docs

00:00:28

 
  Postcheck
passed #788410
amd64 linux
cppcheck

00:00:24

passed #788409
amd64 linux
scan-build

00:11:37

 
Name Stage Failure
failed
gcc:sid:arm64 Build There has been a timeout failure or the job got stuck. Check your timeout limits or try again
No job log
failed
system:gcc:tsan System
make: *** [Makefile:441: test] Error 1
Running after script...
$ find bin -name 'tsan.*' -exec python3 util/parse_tsan.py {} \;
Uploading artifacts...
bin/tests/system/*/tsan.*: found 18 matching files
bin/tests/system/*/*/tsan.*: found 244 matching files

tsan/: found 213 matching files

Uploading artifacts to coordinator... ok
id=788401 responseStatus=201 Created token=EKddKb3y
ERROR: Job failed: exit code 1
failed
system:clang:freebsd12.1:amd64 System
I:      dnstap
*** [test] Error code 1

make: stopped in /builds/isc-projects/bind9/bin/tests/system
Uploading artifacts...
Runtime platform arch=amd64 os=freebsd pid=22743 revision=4c96e5ad version=12.9.0
untracked: found 1367 files

Uploading artifacts to coordinator... ok
id=788407 responseStatus=201 Created token=h4f8xk5_
ERROR: Job failed: exit status 1
failed
system:clang:tsan System
make: *** [Makefile:441: test] Error 1
Running after script...
$ find bin -name 'tsan.*' -exec python3 util/parse_tsan.py {} \;
Uploading artifacts...
bin/tests/system/*/tsan.*: found 640 matching files
bin/tests/system/*/*/tsan.*: found 550 matching files

tsan/: found 1 matching files

Uploading artifacts to coordinator... ok
id=788402 responseStatus=201 Created token=wSq5UkZj
ERROR: Job failed: exit code 1
failed
unit:gcc:tsan Unit
$ find lib -name 'tsan.*' -exec python3 util/parse_tsan.py {} \;
Uploading artifacts...
WARNING: lib/*/tests/tsan.*: no matching files
WARNING: tsan/: no matching files
kyua.log: found 1 matching files

kyua.results: found 1 matching files

kyua_html/: found 69 matching files

Uploading artifacts to coordinator... ok
id=788379 responseStatus=201 Created token=HvBFcAjN
ERROR: Job failed: exit code 1
failed
unit:clang:tsan Unit
$ find lib -name 'tsan.*' -exec python3 util/parse_tsan.py {} \;
Uploading artifacts...
WARNING: lib/*/tests/tsan.*: no matching files
WARNING: tsan/: no matching files
kyua.log: found 1 matching files

kyua.results: found 1 matching files

kyua_html/: found 69 matching files

Uploading artifacts to coordinator... ok
id=788380 responseStatus=201 Created token=QmyyozCT
ERROR: Job failed: exit code 1