have write lock before setting RDATASET_ATTR_STALE in mark_header_stale

Status Job ID Name Coverage
  Precheck
passed #788411
amd64 linux
autoreconf

00:00:34

passed #788413
amd64 linux
clang-format

00:00:26

passed #788414
amd64 linux
coccinelle

00:03:56

passed #788412
amd64 linux
misc

00:00:17

 
  Build
passed #788430
amd64 linux
clang:asan

00:01:52

passed #788434
amd64 linux
clang:buster:amd64

00:01:34

passed #788436
amd64 libvirt
clang:freebsd11.3:amd64

00:02:03

passed #788437
amd64 libvirt
clang:freebsd12.1:amd64

00:01:57

passed #788438
amd64 libvirt
clang:openbsd6.6:amd64

00:05:20

passed #788432
amd64 linux
clang:tsan

00:02:06

passed #788415
amd64 linux
gcc:alpine3.11:amd64

00:02:11

passed #788429
amd64 linux
gcc:asan

00:02:06

passed #788428
amd64 linux
gcc:bionic:amd64

00:01:33

passed #788420
amd64 linux
gcc:buster:amd64

00:01:32

passed #788416
amd64 linux
gcc:centos6:amd64

00:02:13

passed #788417
amd64 linux
gcc:centos7:amd64

00:02:23

passed #788418
amd64 linux
gcc:centos8:amd64

00:02:10

passed #788426
amd64 linux
gcc:fedora31:amd64

00:02:37

passed #788433
amd64 linux
gcc:mutexatomics

00:01:27

passed #788422
amd64 linux
gcc:out-of-tree

00:01:39

passed #788435
amd64 linux
gcc:pkcs11

00:01:18

passed #788421
amd64 linux
gcc:sid:amd64

00:01:41

failed #788423
arm64 linux
gcc:sid:arm64

passed #788424
i386 linux
gcc:sid:i386

00:01:36

passed #788419
amd64 linux
gcc:stretch:amd64

00:01:33

passed #788431
amd64 linux
gcc:tsan

00:01:44

passed #788425
amd64 linux
gcc:tumbleweed:amd64

00:02:32

passed #788427
amd64 linux
gcc:xenial:amd64

00:01:35

passed #788439
amd64 windows
msvc:windows:amd64

00:02:39

 
  Unit
failed #788454
amd64 linux
unit:clang:asan

00:01:40

failed #788458
amd64 linux
unit:clang:buster:amd64

00:01:08

failed #788460
amd64 libvirt
unit:clang:freebsd11.3:amd64

00:01:33

failed #788461
amd64 libvirt
unit:clang:freebsd12.1:amd64

00:01:50

failed #788456
amd64 linux allowed to fail
unit:clang:tsan

00:00:21

failed #788440
amd64 linux
unit:gcc:alpine3.11:amd64

00:01:19

failed #788453
amd64 linux
unit:gcc:asan

00:01:42

failed #788452
amd64 linux
unit:gcc:bionic:amd64

00:01:11

failed #788445
amd64 linux
unit:gcc:buster:amd64

00:01:14

failed #788441
amd64 linux
unit:gcc:centos6:amd64

00:01:16

failed #788442
amd64 linux
unit:gcc:centos7:amd64

00:00:53

failed #788443
amd64 linux
unit:gcc:centos8:amd64

00:01:14

failed #788450
amd64 linux
unit:gcc:fedora31:amd64

00:01:14

failed #788457
amd64 linux
unit:gcc:mutexatomics

00:01:17

failed #788459
amd64 linux
unit:gcc:pkcs11

00:00:51

failed #788446
amd64 linux
unit:gcc:sid:amd64

00:00:48

skipped #788447
arm64 linux
unit:gcc:sid:arm64
failed #788448
i386 linux
unit:gcc:sid:i386

00:01:24

failed #788444
amd64 linux
unit:gcc:stretch:amd64

00:01:11

failed #788455
amd64 linux allowed to fail
unit:gcc:tsan

00:02:27

failed #788449
amd64 linux
unit:gcc:tumbleweed:amd64

00:00:47

failed #788451
amd64 linux
unit:gcc:xenial:amd64

00:01:13

 
  System
failed #788476
amd64 linux
system:clang:asan

00:13:49

failed #788480
amd64 linux
system:clang:buster:amd64

00:11:58

failed #788482
amd64 libvirt
system:clang:freebsd11.3:amd64

00:12:28

failed #788483
amd64 libvirt
system:clang:freebsd12.1:amd64

00:12:54

failed #788478
amd64 linux allowed to fail
system:clang:tsan

00:06:47

failed #788462
amd64 linux
system:gcc:alpine3.11:amd64

00:11:45

failed #788475
amd64 linux
system:gcc:asan

00:12:46

failed #788474
amd64 linux
system:gcc:bionic:amd64

00:10:44

failed #788467
amd64 linux
system:gcc:buster:amd64

00:11:42

failed #788463
amd64 linux
system:gcc:centos6:amd64

00:11:06

failed #788464
amd64 linux
system:gcc:centos7:amd64

00:11:21

failed #788465
amd64 linux
system:gcc:centos8:amd64

00:11:04

failed #788472
amd64 linux
system:gcc:fedora31:amd64

00:11:49

failed #788479
amd64 linux
system:gcc:mutexatomics

00:11:13

failed #788481
amd64 linux
system:gcc:pkcs11

00:13:15

failed #788468
amd64 linux
system:gcc:sid:amd64

00:11:42

skipped #788469
arm64 linux
system:gcc:sid:arm64
failed #788470
i386 linux
system:gcc:sid:i386

00:11:56

failed #788466
amd64 linux
system:gcc:stretch:amd64

00:10:55

failed #788477
amd64 linux allowed to fail
system:gcc:tsan

00:16:36

failed #788471
amd64 linux
system:gcc:tumbleweed:amd64

00:11:02

failed #788473
amd64 linux
system:gcc:xenial:amd64

00:10:46

 
  Docs
passed #788484
amd64 linux
docs

00:00:59

 
  Postcheck
passed #788486
amd64 linux
cppcheck

00:00:42

passed #788485
amd64 linux
scan-build

00:10:36

 
Name Stage Failure
failed
gcc:sid:arm64 Build There has been a timeout failure or the job got stuck. Check your timeout limits or try again
No job log
failed
system:gcc:tsan System
make: *** [Makefile:441: test] Error 1
Running after script...
$ find bin -name 'tsan.*' -exec python3 util/parse_tsan.py {} \;
Uploading artifacts...
bin/tests/system/*/tsan.*: found 18 matching files
bin/tests/system/*/*/tsan.*: found 244 matching files

tsan/: found 196 matching files

Uploading artifacts to coordinator... ok
id=788477 responseStatus=201 Created token=C-zix2uP
ERROR: Job failed: exit code 1
failed
system:clang:asan System
I:      1 FAIL
I: 98 PASS
I:The following system tests failed:
I: serve-stale
make: *** [Makefile:441: test] Error 1
Uploading artifacts...
untracked: found 1447 files
Uploading artifacts to coordinator... ok
id=788476 responseStatus=201 Created token=w-tVTTxs
ERROR: Job failed: exit code 1
failed
system:clang:freebsd12.1:amd64 System
I:      serve-stale
*** [test] Error code 1

make: stopped in /builds/isc-projects/bind9/bin/tests/system
Uploading artifacts...
Runtime platform arch=amd64 os=freebsd pid=22550 revision=4c96e5ad version=12.9.0
untracked: found 1459 files

Uploading artifacts to coordinator... ok
id=788483 responseStatus=201 Created token=kH4izUei
ERROR: Job failed: exit status 1
failed
system:gcc:pkcs11 System
I:      1 SKIPPED
I: 1 UNTESTED
I:The following system tests failed:
I: serve-stale
make: *** [Makefile:441: test] Error 1
Uploading artifacts...
untracked: found 1481 files
Uploading artifacts to coordinator... ok
id=788481 responseStatus=201 Created token=uFxzsRoj
ERROR: Job failed: exit code 1
failed
system:gcc:asan System
I:      1 FAIL
I: 98 PASS
I:The following system tests failed:
I: serve-stale
make: *** [Makefile:441: test] Error 1
Uploading artifacts...
untracked: found 1447 files
Uploading artifacts to coordinator... ok
id=788475 responseStatus=201 Created token=QQ4_A4eb
ERROR: Job failed: exit code 1
failed
system:clang:buster:amd64 System
I:      1 FAIL
I: 98 PASS
I:The following system tests failed:
I: serve-stale
make: *** [Makefile:441: test] Error 1
Uploading artifacts...
untracked: found 1447 files
Uploading artifacts to coordinator... ok
id=788480 responseStatus=201 Created token=JYGBWXEx
ERROR: Job failed: exit code 1
failed
system:clang:freebsd11.3:amd64 System
I:      serve-stale
*** [test] Error code 1

make: stopped in /builds/isc-projects/bind9/bin/tests/system
Uploading artifacts...
Runtime platform arch=amd64 os=freebsd pid=20009 revision=4c96e5ad version=12.9.0
untracked: found 1448 files

Uploading artifacts to coordinator... ok
id=788482 responseStatus=201 Created token=FKNGEHyE
ERROR: Job failed: exit status 1
failed
system:gcc:sid:i386 System
I:     91 PASS
I: 4 UNTESTED
I:The following system tests failed:
I: serve-stale
make: *** [Makefile:441: test] Error 1
Uploading artifacts...
untracked: found 1424 files
Uploading artifacts to coordinator... ok
id=788470 responseStatus=201 Created token=T6Px48xz
ERROR: Job failed: exit code 1
failed
system:gcc:mutexatomics System
I:      1 FAIL
I: 98 PASS
I:The following system tests failed:
I: serve-stale
make: *** [Makefile:441: test] Error 1
Uploading artifacts...
untracked: found 1447 files
Uploading artifacts to coordinator... ok
id=788479 responseStatus=201 Created token=sByWWdch
ERROR: Job failed: exit code 1
failed
system:gcc:fedora31:amd64 System
I:     97 PASS
I:The following system tests failed:
I: rrl
I: serve-stale
make: *** [Makefile:441: test] Error 1
Uploading artifacts...
untracked: found 1523 files
Uploading artifacts to coordinator... ok
id=788472 responseStatus=201 Created token=gznYtZpe
ERROR: Job failed: exit code 1
failed
system:gcc:sid:amd64 System
I:      1 FAIL
I: 99 PASS
I:The following system tests failed:
I: serve-stale
make: *** [Makefile:441: test] Error 1
Uploading artifacts...
untracked: found 1462 files
Uploading artifacts to coordinator... ok
id=788468 responseStatus=201 Created token=zVHJyh9z
ERROR: Job failed: exit code 1
failed
system:gcc:buster:amd64 System
I:      1 FAIL
I: 98 PASS
I:The following system tests failed:
I: serve-stale
make: *** [Makefile:441: test] Error 1
Uploading artifacts...
untracked: found 1447 files
Uploading artifacts to coordinator... ok
id=788467 responseStatus=201 Created token=41MbUGzQ
ERROR: Job failed: exit code 1
failed
system:gcc:alpine3.11:amd64 System
I:      1 FAIL
I: 99 PASS
I:The following system tests failed:
I: serve-stale
make: *** [Makefile:441: test] Error 1
Uploading artifacts...
untracked: found 1494 files
Uploading artifacts to coordinator... ok
id=788462 responseStatus=201 Created token=RYy7f9VP
ERROR: Job failed: exit code 1
failed
system:gcc:bionic:amd64 System
I:     98 PASS
I:The following system tests failed:
I: serve-stale
make: *** [test] Error 1
Makefile:439: recipe for target 'test' failed
Uploading artifacts...
untracked: found 1447 files
Uploading artifacts to coordinator... ok
id=788474 responseStatus=201 Created token=QcbLshTX
ERROR: Job failed: exit code 1
failed
system:gcc:tumbleweed:amd64 System
I:      1 FAIL
I: 98 PASS
I:The following system tests failed:
I: serve-stale
make: *** [Makefile:441: test] Error 1
Uploading artifacts...
untracked: found 1447 files
Uploading artifacts to coordinator... ok
id=788471 responseStatus=201 Created token=n265LD1X
ERROR: Job failed: exit code 1
failed
system:gcc:xenial:amd64 System
I:      1 UNTESTED
I:The following system tests failed:
I: serve-stale
Makefile:439: recipe for target 'test' failed
make: *** [test] Error 1
Uploading artifacts...
untracked: found 1476 files
Uploading artifacts to coordinator... ok
id=788473 responseStatus=201 Created token=DTRsoFt9
ERROR: Job failed: exit code 1
failed
system:gcc:centos7:amd64 System
I:      1 UNTESTED
I:The following system tests failed:
I: pending
I: serve-stale
make: *** [test] Error 1
Uploading artifacts...
untracked: found 1538 files
Uploading artifacts to coordinator... ok
id=788464 responseStatus=201 Created token=sTTNrzA-
ERROR: Job failed: exit code 1
failed
system:gcc:centos8:amd64 System
I:      1 FAIL
I: 98 PASS
I:The following system tests failed:
I: serve-stale
make: *** [Makefile:441: test] Error 1
Uploading artifacts...
untracked: found 1481 files
Uploading artifacts to coordinator... ok
id=788465 responseStatus=201 Created token=MxLsFsfg
ERROR: Job failed: exit code 1
failed
system:gcc:stretch:amd64 System
I:      1 UNTESTED
I:The following system tests failed:
I: serve-stale
Makefile:439: recipe for target 'test' failed
make: *** [test] Error 1
Uploading artifacts...
untracked: found 1447 files
Uploading artifacts to coordinator... ok
id=788466 responseStatus=201 Created token=MXUdaexM
ERROR: Job failed: exit code 1
failed
system:gcc:centos6:amd64 System
I:     97 PASS
I: 1 UNTESTED
I:The following system tests failed:
I: serve-stale
make: *** [test] Error 1
Uploading artifacts...
untracked: found 1481 files
Uploading artifacts to coordinator... ok
id=788463 responseStatus=201 Created token=1t26Exuj
ERROR: Job failed: exit code 1
failed
system:clang:tsan System
make: *** [Makefile:441: test] Error 1
Running after script...
$ find bin -name 'tsan.*' -exec python3 util/parse_tsan.py {} \;
Uploading artifacts...
bin/tests/system/*/tsan.*: found 640 matching files
bin/tests/system/*/*/tsan.*: found 550 matching files

tsan/: found 1 matching files

Uploading artifacts to coordinator... ok
id=788478 responseStatus=201 Created token=BYr8VVtH
ERROR: Job failed: exit code 1
failed
unit:gcc:tsan Unit
$ find lib -name 'tsan.*' -exec python3 util/parse_tsan.py {} \;
Uploading artifacts...
WARNING: lib/*/tests/tsan.*: no matching files
WARNING: tsan/: no matching files
kyua.log: found 1 matching files

kyua.results: found 1 matching files

kyua_html/: found 69 matching files

Uploading artifacts to coordinator... ok
id=788455 responseStatus=201 Created token=Ts5u_9Zc
ERROR: Job failed: exit code 1
failed
unit:gcc:mutexatomics Unit
Generating kyua_html/lib_ns_tests_notify_test_main.html
Generating kyua_html/lib_ns_tests_plugin_test_main.html
Generating kyua_html/lib_ns_tests_query_test_main.html
Generating kyua_html/report.css
Generating kyua_html/index.html
Uploading artifacts...
untracked: found 1363 files
Uploading artifacts to coordinator... ok
id=788457 responseStatus=201 Created token=qb9xNahU
ERROR: Job failed: exit code 1
failed
unit:clang:asan Unit
Generating kyua_html/lib_ns_tests_notify_test_main.html
Generating kyua_html/lib_ns_tests_plugin_test_main.html
Generating kyua_html/lib_ns_tests_query_test_main.html
Generating kyua_html/report.css
Generating kyua_html/index.html
Uploading artifacts...
untracked: found 1365 files
Uploading artifacts to coordinator... ok
id=788454 responseStatus=201 Created token=Yopg7Qxj
ERROR: Job failed: exit code 1
failed
unit:gcc:asan Unit
Generating kyua_html/lib_ns_tests_notify_test_main.html
Generating kyua_html/lib_ns_tests_plugin_test_main.html
Generating kyua_html/lib_ns_tests_query_test_main.html
Generating kyua_html/report.css
Generating kyua_html/index.html
Uploading artifacts...
untracked: found 1365 files
Uploading artifacts to coordinator... ok
id=788453 responseStatus=201 Created token=38ksu7FJ
ERROR: Job failed: exit code 1
failed
unit:clang:buster:amd64 Unit
Generating kyua_html/lib_ns_tests_notify_test_main.html
Generating kyua_html/lib_ns_tests_plugin_test_main.html
Generating kyua_html/lib_ns_tests_query_test_main.html
Generating kyua_html/report.css
Generating kyua_html/index.html
Uploading artifacts...
untracked: found 1364 files
Uploading artifacts to coordinator... ok
id=788458 responseStatus=201 Created token=qCW9q7hs
ERROR: Job failed: exit code 1
failed
unit:gcc:pkcs11 Unit
Generating kyua_html/lib_ns_tests_notify_test_main.html
Generating kyua_html/lib_ns_tests_plugin_test_main.html
Generating kyua_html/lib_ns_tests_query_test_main.html
Generating kyua_html/report.css
Generating kyua_html/index.html
Uploading artifacts...
untracked: found 1397 files
Uploading artifacts to coordinator... ok
id=788459 responseStatus=201 Created token=eqJhsZ4A
ERROR: Job failed: exit code 1
failed
unit:gcc:bionic:amd64 Unit
Generating kyua_html/lib_ns_tests_notify_test_main.html
Generating kyua_html/lib_ns_tests_plugin_test_main.html
Generating kyua_html/lib_ns_tests_query_test_main.html
Generating kyua_html/report.css
Generating kyua_html/index.html
Uploading artifacts...
untracked: found 1363 files
Uploading artifacts to coordinator... ok
id=788452 responseStatus=201 Created token=JMj5EMWt
ERROR: Job failed: exit code 1
failed
unit:gcc:sid:i386 Unit
Generating kyua_html/lib_ns_tests_notify_test_main.html
Generating kyua_html/lib_ns_tests_plugin_test_main.html
Generating kyua_html/lib_ns_tests_query_test_main.html
Generating kyua_html/report.css
Generating kyua_html/index.html
Uploading artifacts...
untracked: found 1358 files
Uploading artifacts to coordinator... ok
id=788448 responseStatus=201 Created token=cjoPGe_s
ERROR: Job failed: exit code 1
failed
unit:clang:freebsd12.1:amd64 Unit
Generating kyua_html/lib_ns_tests_plugin_test_main.html
Generating kyua_html/lib_ns_tests_query_test_main.html
Generating kyua_html/report.css
Generating kyua_html/index.html
Uploading artifacts...
Runtime platform arch=amd64 os=freebsd pid=1741 revision=4c96e5ad version=12.9.0
untracked: found 1374 files

Uploading artifacts to coordinator... ok
id=788461 responseStatus=201 Created token=beyX3Tjf
ERROR: Job failed: exit status 1
failed
unit:gcc:xenial:amd64 Unit
Generating kyua_html/lib_ns_tests_notify_test_main.html
Generating kyua_html/lib_ns_tests_plugin_test_main.html
Generating kyua_html/lib_ns_tests_query_test_main.html
Generating kyua_html/report.css
Generating kyua_html/index.html
Uploading artifacts...
untracked: found 1424 files
Uploading artifacts to coordinator... ok
id=788451 responseStatus=201 Created token=79HQudNr
ERROR: Job failed: exit code 1
failed
unit:gcc:fedora31:amd64 Unit
Generating kyua_html/lib_ns_tests_notify_test_main.html
Generating kyua_html/lib_ns_tests_plugin_test_main.html
Generating kyua_html/lib_ns_tests_query_test_main.html
Generating kyua_html/report.css
Generating kyua_html/index.html
Uploading artifacts...
untracked: found 1429 files
Uploading artifacts to coordinator... ok
id=788450 responseStatus=201 Created token=nyZizy7F
ERROR: Job failed: exit code 1
failed
unit:gcc:buster:amd64 Unit
Generating kyua_html/lib_ns_tests_notify_test_main.html
Generating kyua_html/lib_ns_tests_plugin_test_main.html
Generating kyua_html/lib_ns_tests_query_test_main.html
Generating kyua_html/report.css
Generating kyua_html/index.html
Uploading artifacts...
untracked: found 1363 files
Uploading artifacts to coordinator... ok
id=788445 responseStatus=201 Created token=ZjQi3aka
ERROR: Job failed: exit code 1
failed
unit:clang:tsan Unit
$ find lib -name 'tsan.*' -exec python3 util/parse_tsan.py {} \;
Uploading artifacts...
WARNING: lib/*/tests/tsan.*: no matching files
WARNING: tsan/: no matching files
kyua.log: found 1 matching files

kyua.results: found 1 matching files

kyua_html/: found 69 matching files

Uploading artifacts to coordinator... ok
id=788456 responseStatus=201 Created token=Uk-qr8KS
ERROR: Job failed: exit code 1
failed
unit:gcc:tumbleweed:amd64 Unit
Generating kyua_html/lib_ns_tests_notify_test_main.html
Generating kyua_html/lib_ns_tests_plugin_test_main.html
Generating kyua_html/lib_ns_tests_query_test_main.html
Generating kyua_html/report.css
Generating kyua_html/index.html
Uploading artifacts...
untracked: found 1364 files
Uploading artifacts to coordinator... ok
id=788449 responseStatus=201 Created token=pmMBjxvG
ERROR: Job failed: exit code 1
failed
unit:gcc:sid:amd64 Unit
Generating kyua_html/lib_ns_tests_notify_test_main.html
Generating kyua_html/lib_ns_tests_plugin_test_main.html
Generating kyua_html/lib_ns_tests_query_test_main.html
Generating kyua_html/report.css
Generating kyua_html/index.html
Uploading artifacts...
untracked: found 1378 files
Uploading artifacts to coordinator... ok
id=788446 responseStatus=201 Created token=L8TxLgru
ERROR: Job failed: exit code 1
failed
unit:gcc:stretch:amd64 Unit
Generating kyua_html/lib_ns_tests_notify_test_main.html
Generating kyua_html/lib_ns_tests_plugin_test_main.html
Generating kyua_html/lib_ns_tests_query_test_main.html
Generating kyua_html/report.css
Generating kyua_html/index.html
Uploading artifacts...
untracked: found 1363 files
Uploading artifacts to coordinator... ok
id=788444 responseStatus=201 Created token=BSxequwy
ERROR: Job failed: exit code 1
failed
unit:gcc:centos8:amd64 Unit
Generating kyua_html/lib_ns_tests_notify_test_main.html
Generating kyua_html/lib_ns_tests_plugin_test_main.html
Generating kyua_html/lib_ns_tests_query_test_main.html
Generating kyua_html/report.css
Generating kyua_html/index.html
Uploading artifacts...
untracked: found 1429 files
Uploading artifacts to coordinator... ok
id=788443 responseStatus=201 Created token=3fTurrwh
ERROR: Job failed: exit code 1
failed
unit:gcc:centos6:amd64 Unit
Generating kyua_html/lib_ns_tests_notify_test_main.html
Generating kyua_html/lib_ns_tests_plugin_test_main.html
Generating kyua_html/lib_ns_tests_query_test_main.html
Generating kyua_html/report.css
Generating kyua_html/index.html
Uploading artifacts...
untracked: found 1429 files
Uploading artifacts to coordinator... ok
id=788441 responseStatus=201 Created token=fyv6N_mb
ERROR: Job failed: exit code 1
failed
unit:gcc:alpine3.11:amd64 Unit
Generating kyua_html/lib_ns_tests_notify_test_main.html
Generating kyua_html/lib_ns_tests_plugin_test_main.html
Generating kyua_html/lib_ns_tests_query_test_main.html
Generating kyua_html/report.css
Generating kyua_html/index.html
Uploading artifacts...
untracked: found 1439 files
Uploading artifacts to coordinator... ok
id=788440 responseStatus=201 Created token=aasd9qMK
ERROR: Job failed: exit code 1
failed
unit:gcc:centos7:amd64 Unit
Generating kyua_html/lib_ns_tests_notify_test_main.html
Generating kyua_html/lib_ns_tests_plugin_test_main.html
Generating kyua_html/lib_ns_tests_query_test_main.html
Generating kyua_html/report.css
Generating kyua_html/index.html
Uploading artifacts...
untracked: found 1438 files
Uploading artifacts to coordinator... ok
id=788442 responseStatus=201 Created token=L_YcXVci
ERROR: Job failed: exit code 1
failed
unit:clang:freebsd11.3:amd64 Unit
Generating kyua_html/lib_ns_tests_plugin_test_main.html
Generating kyua_html/lib_ns_tests_query_test_main.html
Generating kyua_html/report.css
Generating kyua_html/index.html
Uploading artifacts...
Runtime platform arch=amd64 os=freebsd pid=1680 revision=4c96e5ad version=12.9.0
untracked: found 1364 files

Uploading artifacts to coordinator... ok
id=788460 responseStatus=201 Created token=ZCzofs8m
ERROR: Job failed: exit status 1