Doc: add prefetch-additional and srv-full-additional to ARM

Status Job ID Name Coverage
  Precheck
passed #788958
amd64 linux
autoreconf

00:00:34

passed #788960
amd64 linux
clang-format

00:00:21

passed #788961
amd64 linux
coccinelle

00:03:25

passed #788959
amd64 linux
misc

00:00:17

 
  Build
failed #788977
amd64 linux
clang:asan

00:02:12

failed #788981
amd64 linux
clang:buster:amd64

00:01:20

failed #788983
amd64 libvirt
clang:freebsd11.3:amd64

00:01:21

failed #788984
amd64 libvirt
clang:freebsd12.1:amd64

00:01:18

passed #788985
amd64 libvirt
clang:openbsd6.6:amd64

00:04:17

failed #788979
amd64 linux
clang:tsan

00:01:35

failed #788962
amd64 linux
gcc:alpine3.11:amd64

00:01:37

failed #788976
amd64 linux
gcc:asan

00:01:54

failed #788975
amd64 linux
gcc:bionic:amd64

00:01:24

failed #788967
amd64 linux
gcc:buster:amd64

00:01:25

failed #788963
amd64 linux
gcc:centos6:amd64

00:01:21

failed #788964
amd64 linux
gcc:centos7:amd64

00:01:34

failed #788965
amd64 linux
gcc:centos8:amd64

00:01:34

failed #788973
amd64 linux
gcc:fedora31:amd64

00:01:44

failed #788980
amd64 linux
gcc:mutexatomics

00:01:12

failed #788969
amd64 linux
gcc:out-of-tree

00:01:12

failed #788982
amd64 linux
gcc:pkcs11

00:01:20

failed #788968
amd64 linux
gcc:sid:amd64

00:01:14

failed #788970
arm64 linux
gcc:sid:arm64

failed #788971
i386 linux
gcc:sid:i386

00:01:14

failed #788966
amd64 linux
gcc:stretch:amd64

00:01:24

failed #788978
amd64 linux
gcc:tsan

00:01:31

failed #788972
amd64 linux
gcc:tumbleweed:amd64

00:01:43

failed #788974
amd64 linux
gcc:xenial:amd64

00:01:29

failed #788986
amd64 windows
msvc:windows:amd64

00:02:08

 
  Unit
skipped #789001
amd64 linux
unit:clang:asan
skipped #789005
amd64 linux
unit:clang:buster:amd64
skipped #789007
amd64 libvirt
unit:clang:freebsd11.3:amd64
skipped #789008
amd64 libvirt
unit:clang:freebsd12.1:amd64
skipped #789003
amd64 linux allowed to fail
unit:clang:tsan
skipped #788987
amd64 linux
unit:gcc:alpine3.11:amd64
skipped #789000
amd64 linux
unit:gcc:asan
skipped #788999
amd64 linux
unit:gcc:bionic:amd64
skipped #788992
amd64 linux
unit:gcc:buster:amd64
skipped #788988
amd64 linux
unit:gcc:centos6:amd64
skipped #788989
amd64 linux
unit:gcc:centos7:amd64
skipped #788990
amd64 linux
unit:gcc:centos8:amd64
skipped #788997
amd64 linux
unit:gcc:fedora31:amd64
skipped #789004
amd64 linux
unit:gcc:mutexatomics
skipped #789006
amd64 linux
unit:gcc:pkcs11
skipped #788993
amd64 linux
unit:gcc:sid:amd64
skipped #788994
arm64 linux
unit:gcc:sid:arm64
skipped #788995
i386 linux
unit:gcc:sid:i386
skipped #788991
amd64 linux
unit:gcc:stretch:amd64
skipped #789002
amd64 linux allowed to fail
unit:gcc:tsan
skipped #788996
amd64 linux
unit:gcc:tumbleweed:amd64
skipped #788998
amd64 linux
unit:gcc:xenial:amd64
 
  System
skipped #789023
amd64 linux
system:clang:asan
skipped #789027
amd64 linux
system:clang:buster:amd64
skipped #789029
amd64 libvirt
system:clang:freebsd11.3:amd64
skipped #789030
amd64 libvirt
system:clang:freebsd12.1:amd64
skipped #789025
amd64 linux allowed to fail
system:clang:tsan
skipped #789009
amd64 linux
system:gcc:alpine3.11:amd64
skipped #789022
amd64 linux
system:gcc:asan
skipped #789021
amd64 linux
system:gcc:bionic:amd64
skipped #789014
amd64 linux
system:gcc:buster:amd64
skipped #789010
amd64 linux
system:gcc:centos6:amd64
skipped #789011
amd64 linux
system:gcc:centos7:amd64
skipped #789012
amd64 linux
system:gcc:centos8:amd64
skipped #789019
amd64 linux
system:gcc:fedora31:amd64
skipped #789026
amd64 linux
system:gcc:mutexatomics
skipped #789028
amd64 linux
system:gcc:pkcs11
skipped #789015
amd64 linux
system:gcc:sid:amd64
skipped #789016
arm64 linux
system:gcc:sid:arm64
skipped #789017
i386 linux
system:gcc:sid:i386
skipped #789013
amd64 linux
system:gcc:stretch:amd64
skipped #789024
amd64 linux allowed to fail
system:gcc:tsan
skipped #789018
amd64 linux
system:gcc:tumbleweed:amd64
skipped #789020
amd64 linux
system:gcc:xenial:amd64
 
  Docs
passed #789031
amd64 linux
docs

00:01:13

 
  Postcheck
passed #789033
amd64 linux
cppcheck

00:00:39

passed #789032
amd64 linux
scan-build

00:08:58

 
Name Stage Failure
failed
gcc:sid:arm64 Build There has been a timeout failure or the job got stuck. Check your timeout limits or try again
No job log
failed
msvc:windows:amd64 Build
       (Link target) -> 
query.obj : error LNK2019: unresolved external symbol ns_client_replace referenced in function query_fetch_additional [C:\builds\isc-projects\bind9\lib\ns\win32\libns.vcxproj]
..\..\..\Build\Release\libns.dll : fatal error LNK1120: 1 unresolved externals [C:\builds\isc-projects\bind9\lib\ns\win32\libns.vcxproj]

875 Warning(s)
2 Error(s)

Time Elapsed 00:01:30.96
ERROR: Job failed: exit status 1
failed
clang:asan Build
make[2]: Leaving directory '/builds/isc-projects/bind9/lib/ns'
make[2]: *** [Makefile:187: testdirs] Error 1
make[2]: Target 'all' not remade because of errors.
make[1]: Leaving directory '/builds/isc-projects/bind9/lib'
make[1]: *** [Makefile:84: subdirs] Error 1
make[1]: Target 'all' not remade because of errors.
make: *** [Makefile:87: subdirs] Error 1
make: Target 'all' not remade because of errors.
ERROR: Job failed: exit code 1
failed
gcc:asan Build
make[2]: *** [Makefile:187: testdirs] Error 1
make[2]: Target 'all' not remade because of errors.
make[2]: Leaving directory '/builds/isc-projects/bind9/lib/ns'
make[1]: Leaving directory '/builds/isc-projects/bind9/lib'
make[1]: *** [Makefile:84: subdirs] Error 1
make[1]: Target 'all' not remade because of errors.
make: *** [Makefile:87: subdirs] Error 1
make: Target 'all' not remade because of errors.
ERROR: Job failed: exit code 1
failed
gcc:fedora31:amd64 Build
make[2]: Leaving directory '/builds/isc-projects/bind9/lib/ns'
make[2]: *** [Makefile:187: testdirs] Error 1
make[2]: Target 'all' not remade because of errors.
make[1]: *** [Makefile:84: subdirs] Error 1
make[1]: Target 'all' not remade because of errors.
make[1]: Leaving directory '/builds/isc-projects/bind9/lib'
make: *** [Makefile:87: subdirs] Error 1
make: Target 'all' not remade because of errors.
ERROR: Job failed: exit code 1
failed
gcc:tumbleweed:amd64 Build
make[2]: *** [Makefile:187: testdirs] Error 1
make[2]: Target 'all' not remade because of errors.
make[2]: Leaving directory '/builds/isc-projects/bind9/lib/ns'
make[1]: *** [Makefile:84: subdirs] Error 1
make[1]: Target 'all' not remade because of errors.
make[1]: Leaving directory '/builds/isc-projects/bind9/lib'
make: *** [Makefile:87: subdirs] Error 1
make: Target 'all' not remade because of errors.
ERROR: Job failed: exit code 1
failed
clang:tsan Build
make[2]: *** [Makefile:187: testdirs] Error 1
make[2]: Target 'all' not remade because of errors.
make[2]: Leaving directory '/builds/isc-projects/bind9/lib/ns'
make[1]: *** [Makefile:84: subdirs] Error 1
make[1]: Target 'all' not remade because of errors.
make[1]: Leaving directory '/builds/isc-projects/bind9/lib'
make: *** [Makefile:87: subdirs] Error 1
make: Target 'all' not remade because of errors.
ERROR: Job failed: exit code 1
failed
gcc:alpine3.11:amd64 Build
make[2]: *** [Makefile:187: testdirs] Error 1
make[2]: Leaving directory '/builds/isc-projects/bind9/lib/ns'
make[2]: Target 'all' not remade because of errors.
make[1]: *** [Makefile:84: subdirs] Error 1
make[1]: Target 'all' not remade because of errors.
make[1]: Leaving directory '/builds/isc-projects/bind9/lib'
make: *** [Makefile:87: subdirs] Error 1
make: Target 'all' not remade because of errors.
ERROR: Job failed: exit code 1
failed
gcc:tsan Build
make[2]: *** [Makefile:187: testdirs] Error 1
make[2]: Target 'all' not remade because of errors.
make[2]: Leaving directory '/builds/isc-projects/bind9/lib/ns'
make[1]: *** [Makefile:84: subdirs] Error 1
make[1]: Target 'all' not remade because of errors.
make[1]: Leaving directory '/builds/isc-projects/bind9/lib'
make: *** [Makefile:87: subdirs] Error 1
make: Target 'all' not remade because of errors.
ERROR: Job failed: exit code 1
failed
gcc:centos8:amd64 Build
make[2]: *** [Makefile:187: testdirs] Error 1
make[2]: Target 'all' not remade because of errors.
make[2]: Leaving directory '/builds/isc-projects/bind9/lib/ns'
make[1]: Leaving directory '/builds/isc-projects/bind9/lib'
make[1]: *** [Makefile:84: subdirs] Error 1
make[1]: Target 'all' not remade because of errors.
make: *** [Makefile:87: subdirs] Error 1
make: Target 'all' not remade because of errors.
ERROR: Job failed: exit code 1
failed
gcc:centos7:amd64 Build
make[2]: *** [testdirs] Error 1
make[2]: Target `all' not remade because of errors.
make[2]: Leaving directory `/builds/isc-projects/bind9/lib/ns'
make[1]: *** [subdirs] Error 1
make[1]: Target `all' not remade because of errors.
make[1]: Leaving directory `/builds/isc-projects/bind9/lib'
make: *** [subdirs] Error 1
make: Target `all' not remade because of errors.
ERROR: Job failed: exit code 1
failed
clang:freebsd11.3:amd64 Build

make[2]: stopped in /builds/isc-projects/bind9/lib/ns
*** [subdirs] Error code 1

make[1]: stopped in /builds/isc-projects/bind9/lib
*** [subdirs] Error code 1

make: stopped in /builds/isc-projects/bind9
ERROR: Job failed: exit status 1
failed
gcc:xenial:amd64 Build
make[2]: Target 'all' not remade because of errors.
Makefile:84: recipe for target 'subdirs' failed
make[1]: Leaving directory '/builds/isc-projects/bind9/lib'
make[1]: *** [subdirs] Error 1
make[1]: Target 'all' not remade because of errors.
Makefile:87: recipe for target 'subdirs' failed
make: *** [subdirs] Error 1
make: Target 'all' not remade because of errors.
ERROR: Job failed: exit code 1
failed
clang:freebsd12.1:amd64 Build

make[2]: stopped in /builds/isc-projects/bind9/lib/ns
*** [subdirs] Error code 1

make[1]: stopped in /builds/isc-projects/bind9/lib
*** [subdirs] Error code 1

make: stopped in /builds/isc-projects/bind9
ERROR: Job failed: exit status 1
failed
gcc:bionic:amd64 Build
make[2]: Leaving directory '/builds/isc-projects/bind9/lib/ns'
Makefile:84: recipe for target 'subdirs' failed
make[1]: Leaving directory '/builds/isc-projects/bind9/lib'
make[1]: *** [subdirs] Error 1
make[1]: Target 'all' not remade because of errors.
Makefile:87: recipe for target 'subdirs' failed
make: *** [subdirs] Error 1
make: Target 'all' not remade because of errors.
ERROR: Job failed: exit code 1
failed
gcc:pkcs11 Build
make[2]: *** [Makefile:187: testdirs] Error 1
make[2]: Target 'all' not remade because of errors.
make[2]: Leaving directory '/builds/isc-projects/bind9/lib/ns'
make[1]: *** [Makefile:84: subdirs] Error 1
make[1]: Target 'all' not remade because of errors.
make[1]: Leaving directory '/builds/isc-projects/bind9/lib'
make: *** [Makefile:87: subdirs] Error 1
make: Target 'all' not remade because of errors.
ERROR: Job failed: exit code 1
failed
clang:buster:amd64 Build
make[2]: *** [Makefile:187: testdirs] Error 1
make[2]: Target 'all' not remade because of errors.
make[2]: Leaving directory '/builds/isc-projects/bind9/lib/ns'
make[1]: *** [Makefile:84: subdirs] Error 1
make[1]: Target 'all' not remade because of errors.
make[1]: Leaving directory '/builds/isc-projects/bind9/lib'
make: *** [Makefile:87: subdirs] Error 1
make: Target 'all' not remade because of errors.
ERROR: Job failed: exit code 1
failed
gcc:buster:amd64 Build
make[2]: *** [Makefile:187: testdirs] Error 1
make[2]: Target 'all' not remade because of errors.
make[2]: Leaving directory '/builds/isc-projects/bind9/lib/ns'
make[1]: *** [Makefile:84: subdirs] Error 1
make[1]: Target 'all' not remade because of errors.
make[1]: Leaving directory '/builds/isc-projects/bind9/lib'
make: *** [Makefile:87: subdirs] Error 1
make: Target 'all' not remade because of errors.
ERROR: Job failed: exit code 1
failed
gcc:stretch:amd64 Build
make[2]: Leaving directory '/builds/isc-projects/bind9/lib/ns'
Makefile:84: recipe for target 'subdirs' failed
make[1]: *** [subdirs] Error 1
make[1]: Target 'all' not remade because of errors.
make[1]: Leaving directory '/builds/isc-projects/bind9/lib'
Makefile:87: recipe for target 'subdirs' failed
make: *** [subdirs] Error 1
make: Target 'all' not remade because of errors.
ERROR: Job failed: exit code 1
failed
gcc:centos6:amd64 Build
make[2]: *** [testdirs] Error 1
make[2]: Target `all' not remade because of errors.
make[2]: Leaving directory `/builds/isc-projects/bind9/lib/ns'
make[1]: *** [subdirs] Error 1
make[1]: Target `all' not remade because of errors.
make[1]: Leaving directory `/builds/isc-projects/bind9/lib'
make: *** [subdirs] Error 1
make: Target `all' not remade because of errors.
ERROR: Job failed: exit code 1
failed
gcc:mutexatomics Build
make[2]: Leaving directory '/builds/isc-projects/bind9/lib/ns'
make[2]: *** [Makefile:187: testdirs] Error 1
make[2]: Target 'all' not remade because of errors.
make[1]: Leaving directory '/builds/isc-projects/bind9/lib'
make[1]: *** [Makefile:84: subdirs] Error 1
make[1]: Target 'all' not remade because of errors.
make: *** [Makefile:87: subdirs] Error 1
make: Target 'all' not remade because of errors.
ERROR: Job failed: exit code 1
failed
gcc:sid:i386 Build
make[2]: *** [Makefile:187: testdirs] Error 1
make[2]: Target 'all' not remade because of errors.
make[2]: Leaving directory '/builds/isc-projects/bind9/lib/ns'
make[1]: *** [Makefile:84: subdirs] Error 1
make[1]: Target 'all' not remade because of errors.
make[1]: Leaving directory '/builds/isc-projects/bind9/lib'
make: *** [Makefile:87: subdirs] Error 1
make: Target 'all' not remade because of errors.
ERROR: Job failed: exit code 1
failed
gcc:sid:amd64 Build
make[2]: Leaving directory '/builds/isc-projects/bind9/lib/ns'
make[2]: *** [Makefile:187: testdirs] Error 1
make[2]: Target 'all' not remade because of errors.
make[1]: Leaving directory '/builds/isc-projects/bind9/lib'
make[1]: *** [Makefile:84: subdirs] Error 1
make[1]: Target 'all' not remade because of errors.
make: *** [Makefile:87: subdirs] Error 1
make: Target 'all' not remade because of errors.
ERROR: Job failed: exit code 1
failed
gcc:out-of-tree Build
make[2]: *** [Makefile:187: testdirs] Error 1
make[2]: Target 'all' not remade because of errors.
make[2]: Leaving directory '/builds/isc-projects/bind9/workspace/lib/ns'
make[1]: *** [Makefile:84: subdirs] Error 1
make[1]: Target 'all' not remade because of errors.
make[1]: Leaving directory '/builds/isc-projects/bind9/workspace/lib'
make: *** [Makefile:87: subdirs] Error 1
make: Target 'all' not remade because of errors.
ERROR: Job failed: exit code 1