change "expr == false" to "!expr" in conditionals

76 jobs for !3312 with each-bool-conditionals in 7 minutes and 38 seconds (queued for 9 seconds)
detached
Status Job ID Name Coverage
  Precheck
passed #793765
amd64 linux
autoreconf

00:00:18

passed #793767
amd64 linux
clang-format

00:00:23

passed #793768
amd64 linux
coccinelle

00:03:36

passed #793766
amd64 linux
misc

00:00:17

 
  Build
failed #793784
amd64 linux
clang:asan

00:00:35

failed #793788
amd64 linux
clang:buster:amd64

00:00:26

failed #793790
amd64 libvirt
clang:freebsd11.3:amd64

00:00:43

failed #793791
amd64 libvirt
clang:freebsd12.1:amd64

00:00:43

failed #793792
amd64 libvirt
clang:openbsd6.6:amd64

00:01:18

failed #793786
amd64 linux
clang:tsan

00:00:32

failed #793769
amd64 linux
gcc:alpine3.11:amd64

00:00:33

failed #793783
amd64 linux
gcc:asan

00:00:31

failed #793782
amd64 linux
gcc:bionic:amd64

00:00:24

failed #793774
amd64 linux
gcc:buster:amd64

00:00:21

failed #793770
amd64 linux
gcc:centos6:amd64

00:00:33

failed #793771
amd64 linux
gcc:centos7:amd64

00:00:27

failed #793772
amd64 linux
gcc:centos8:amd64

00:00:37

failed #793780
amd64 linux
gcc:fedora31:amd64

00:00:28

failed #793787
amd64 linux
gcc:mutexatomics

00:00:23

failed #793776
amd64 linux
gcc:out-of-tree

00:00:29

failed #793789
amd64 linux
gcc:pkcs11

00:00:26

failed #793775
amd64 linux
gcc:sid:amd64

00:00:30

failed #793777
arm64 linux
gcc:sid:arm64

00:00:39

failed #793778
i386 linux
gcc:sid:i386

00:00:24

failed #793773
amd64 linux
gcc:stretch:amd64

00:00:30

failed #793785
amd64 linux
gcc:tsan

00:00:25

failed #793779
amd64 linux
gcc:tumbleweed:amd64

00:00:28

failed #793781
amd64 linux
gcc:xenial:amd64

00:00:24

failed #793793
amd64 windows
msvc:windows:amd64

00:01:07

 
  Unit
skipped #793808
amd64 linux
unit:clang:asan
skipped #793812
amd64 linux
unit:clang:buster:amd64
skipped #793814
amd64 libvirt
unit:clang:freebsd11.3:amd64
skipped #793815
amd64 libvirt
unit:clang:freebsd12.1:amd64
skipped #793810
amd64 linux allowed to fail
unit:clang:tsan
skipped #793794
amd64 linux
unit:gcc:alpine3.11:amd64
skipped #793807
amd64 linux
unit:gcc:asan
skipped #793806
amd64 linux
unit:gcc:bionic:amd64
skipped #793799
amd64 linux
unit:gcc:buster:amd64
skipped #793795
amd64 linux
unit:gcc:centos6:amd64
skipped #793796
amd64 linux
unit:gcc:centos7:amd64
skipped #793797
amd64 linux
unit:gcc:centos8:amd64
skipped #793804
amd64 linux
unit:gcc:fedora31:amd64
skipped #793811
amd64 linux
unit:gcc:mutexatomics
skipped #793813
amd64 linux
unit:gcc:pkcs11
skipped #793800
amd64 linux
unit:gcc:sid:amd64
skipped #793801
arm64 linux
unit:gcc:sid:arm64
skipped #793802
i386 linux
unit:gcc:sid:i386
skipped #793798
amd64 linux
unit:gcc:stretch:amd64
skipped #793809
amd64 linux allowed to fail
unit:gcc:tsan
skipped #793803
amd64 linux
unit:gcc:tumbleweed:amd64
skipped #793805
amd64 linux
unit:gcc:xenial:amd64
 
  System
skipped #793830
amd64 linux
system:clang:asan
skipped #793834
amd64 linux
system:clang:buster:amd64
skipped #793836
amd64 libvirt
system:clang:freebsd11.3:amd64
skipped #793837
amd64 libvirt
system:clang:freebsd12.1:amd64
skipped #793832
amd64 linux allowed to fail
system:clang:tsan
skipped #793816
amd64 linux
system:gcc:alpine3.11:amd64
skipped #793829
amd64 linux
system:gcc:asan
skipped #793828
amd64 linux
system:gcc:bionic:amd64
skipped #793821
amd64 linux
system:gcc:buster:amd64
skipped #793817
amd64 linux
system:gcc:centos6:amd64
skipped #793818
amd64 linux
system:gcc:centos7:amd64
skipped #793819
amd64 linux
system:gcc:centos8:amd64
skipped #793826
amd64 linux
system:gcc:fedora31:amd64
skipped #793833
amd64 linux
system:gcc:mutexatomics
skipped #793835
amd64 linux
system:gcc:pkcs11
skipped #793822
amd64 linux
system:gcc:sid:amd64
skipped #793823
arm64 linux
system:gcc:sid:arm64
skipped #793824
i386 linux
system:gcc:sid:i386
skipped #793820
amd64 linux
system:gcc:stretch:amd64
skipped #793831
amd64 linux allowed to fail
system:gcc:tsan
skipped #793825
amd64 linux
system:gcc:tumbleweed:amd64
skipped #793827
amd64 linux
system:gcc:xenial:amd64
 
  Docs
passed #793838
amd64 linux
docs

00:00:29

 
  Postcheck
passed #793840
amd64 linux
cppcheck

00:00:25

passed #793839
amd64 linux
scan-build

00:06:45

 
Name Stage Failure
failed
clang:openbsd6.6:amd64 Build
Error target(s) unaccounted for: ../lib/dns/libdns.la dns_rdata_fromwire_text.lo dns_name_fromtext_target ../lib/isc/libisc.la main.lo testdirs dns_name_fromtext_target.lo all dns_rdata_fromwire_text 
`all' not remade because of errors.
Errors while building
*** Error 1 in target 'subdirs', line 92 of Makefile (continuing)
Error target(s) unaccounted for: subdirs testdirs all
`all' not remade because of errors.
Running after_script
Uploading artifacts for failed job
ERROR: Job failed: exit status 1
failed
msvc:windows:amd64 Build
         c:\builds\isc-projects\bind9\lib\isc\app.c(254): error C2059: syntax error: '}' [C:\builds\isc-projects\bind9\lib\isc\win32\libisc.vcxproj]
c:\builds\isc-projects\bind9\lib\isc\app.c(358): error C2059: syntax error: 'return' [C:\builds\isc-projects\bind9\lib\isc\win32\libisc.vcxproj]
c:\builds\isc-projects\bind9\lib\isc\app.c(359): error C2059: syntax error: '}' [C:\builds\isc-projects\bind9\lib\isc\win32\libisc.vcxproj]

137 Warning(s)
15 Error(s)

Time Elapsed 00:00:32.24
ERROR: Job failed: exit status 1
failed
clang:freebsd12.1:amd64 Build
*** [subdirs] Error code 1

make[1]: stopped in /builds/isc-projects/bind9/lib
*** [subdirs] Error code 1

make: stopped in /builds/isc-projects/bind9
Running after_script
Uploading artifacts for failed job
ERROR: Job failed: exit status 1
failed
clang:freebsd11.3:amd64 Build
*** [subdirs] Error code 1

make[1]: stopped in /builds/isc-projects/bind9/lib
*** [subdirs] Error code 1

make: stopped in /builds/isc-projects/bind9
Running after_script
Uploading artifacts for failed job
ERROR: Job failed: exit status 1
failed
clang:tsan Build
make[2]: Leaving directory '/builds/isc-projects/bind9/lib/isc'
make[1]: *** [Makefile:84: subdirs] Error 1
make[1]: Target 'all' not remade because of errors.
make[1]: Leaving directory '/builds/isc-projects/bind9/lib'
make: *** [Makefile:87: subdirs] Error 1
make: Target 'all' not remade because of errors.
Running after_script
Uploading artifacts for failed job
ERROR: Job failed: exit code 1
failed
clang:asan Build
make[2]: Leaving directory '/builds/isc-projects/bind9/lib/isc'
make[1]: *** [Makefile:84: subdirs] Error 1
make[1]: Target 'all' not remade because of errors.
make[1]: Leaving directory '/builds/isc-projects/bind9/lib'
make: *** [Makefile:87: subdirs] Error 1
make: Target 'all' not remade because of errors.
Running after_script
Uploading artifacts for failed job
ERROR: Job failed: exit code 1
failed
clang:buster:amd64 Build
make[2]: Target 'all' not remade because of errors.
make[1]: Leaving directory '/builds/isc-projects/bind9/lib'
make[1]: *** [Makefile:84: subdirs] Error 1
make[1]: Target 'all' not remade because of errors.
make: *** [Makefile:87: subdirs] Error 1
make: Target 'all' not remade because of errors.
Running after_script
Uploading artifacts for failed job
ERROR: Job failed: exit code 1
failed
gcc:pkcs11 Build
make[2]: Target 'all' not remade because of errors.
make[1]: *** [Makefile:84: subdirs] Error 1
make[1]: Target 'all' not remade because of errors.
make[1]: Leaving directory '/builds/isc-projects/bind9/lib'
make: *** [Makefile:87: subdirs] Error 1
make: Target 'all' not remade because of errors.
Running after_script
Uploading artifacts for failed job
ERROR: Job failed: exit code 1
failed
gcc:sid:arm64 Build
libtool: compile:  gcc -include /builds/isc-projects/bind9/config.h -I/builds/isc-projects/bind9 -I../.. -I./unix/include -I./pthreads/include -I./include -I./include -I/builds/isc-projects/bind9/lib/dns/include -I../../lib/dns/include -I/usr/include/json-c -I/usr/include/libxml2 -DISC_MEM_DEFAULTFILL=1 -DISC_LIST_CHECKINIT=1 -fno-omit-frame-pointer -fno-optimize-sibling-calls -O1 -g -Wall -Wextra -Og -pthread -fPIC -W -Wall -Wmissing-prototypes -Wcast-qual -Wwrite-strings -Wformat -Wpointer-arith -Wno-missing-field-initializers -fno-strict-aliasing -Wshadow -Werror -DVERSION=\"9.17.0\" -DLIBINTERFACE=1700 -DLIBREVISION=0 -DLIBAGE=0 -c ./version.c  -fPIC -DPIC -o .libs/version.o
make[2]: Target 'all' not remade because of errors.
make[2]: Leaving directory '/builds/isc-projects/bind9/lib/isc'
make[1]: Leaving directory '/builds/isc-projects/bind9/lib'
make[1]: *** [Makefile:84: subdirs] Error 1
make[1]: Target 'all' not remade because of errors.
make: *** [Makefile:87: subdirs] Error 1
make: Target 'all' not remade because of errors.
ERROR: Job failed: exit code 1
failed
gcc:asan Build
make[2]: Target 'all' not remade because of errors.
make[1]: *** [Makefile:84: subdirs] Error 1
make[1]: Target 'all' not remade because of errors.
make[1]: Leaving directory '/builds/isc-projects/bind9/lib'
make: *** [Makefile:87: subdirs] Error 1
make: Target 'all' not remade because of errors.
Running after_script
Uploading artifacts for failed job
ERROR: Job failed: exit code 1
failed
gcc:mutexatomics Build
make[2]: Target 'all' not remade because of errors.
make[1]: *** [Makefile:84: subdirs] Error 1
make[1]: Target 'all' not remade because of errors.
make[1]: Leaving directory '/builds/isc-projects/bind9/lib'
make: *** [Makefile:87: subdirs] Error 1
make: Target 'all' not remade because of errors.
Running after_script
Uploading artifacts for failed job
ERROR: Job failed: exit code 1
failed
gcc:tsan Build
make[2]: Leaving directory '/builds/isc-projects/bind9/lib/isc'
make[1]: *** [Makefile:84: subdirs] Error 1
make[1]: Target 'all' not remade because of errors.
make[1]: Leaving directory '/builds/isc-projects/bind9/lib'
make: *** [Makefile:87: subdirs] Error 1
make: Target 'all' not remade because of errors.
Running after_script
Uploading artifacts for failed job
ERROR: Job failed: exit code 1
failed
gcc:fedora31:amd64 Build
make[2]: Leaving directory '/builds/isc-projects/bind9/lib/isc'
make[1]: *** [Makefile:84: subdirs] Error 1
make[1]: Target 'all' not remade because of errors.
make[1]: Leaving directory '/builds/isc-projects/bind9/lib'
make: *** [Makefile:87: subdirs] Error 1
make: Target 'all' not remade because of errors.
Running after_script
Uploading artifacts for failed job
ERROR: Job failed: exit code 1
failed
gcc:bionic:amd64 Build
make[1]: Leaving directory '/builds/isc-projects/bind9/lib'
make[1]: *** [subdirs] Error 1
make[1]: Target 'all' not remade because of errors.
Makefile:87: recipe for target 'subdirs' failed
make: *** [subdirs] Error 1
make: Target 'all' not remade because of errors.
Running after_script
Uploading artifacts for failed job
ERROR: Job failed: exit code 1
failed
gcc:tumbleweed:amd64 Build
make[2]: Target 'all' not remade because of errors.
make[1]: Leaving directory '/builds/isc-projects/bind9/lib'
make[1]: *** [Makefile:84: subdirs] Error 1
make[1]: Target 'all' not remade because of errors.
make: *** [Makefile:87: subdirs] Error 1
make: Target 'all' not remade because of errors.
Running after_script
Uploading artifacts for failed job
ERROR: Job failed: exit code 1
failed
gcc:xenial:amd64 Build
make[1]: Leaving directory '/builds/isc-projects/bind9/lib'
make[1]: *** [subdirs] Error 1
make[1]: Target 'all' not remade because of errors.
make: *** [subdirs] Error 1
make: Target 'all' not remade because of errors.
Makefile:87: recipe for target 'subdirs' failed
Running after_script
Uploading artifacts for failed job
ERROR: Job failed: exit code 1
failed
gcc:out-of-tree Build
make[2]: Target 'all' not remade because of errors.
make[1]: *** [Makefile:84: subdirs] Error 1
make[1]: Target 'all' not remade because of errors.
make[1]: Leaving directory '/builds/isc-projects/bind9/workspace/lib'
make: *** [Makefile:87: subdirs] Error 1
make: Target 'all' not remade because of errors.
Running after_script
Uploading artifacts for failed job
ERROR: Job failed: exit code 1
failed
gcc:centos8:amd64 Build
make[2]: Leaving directory '/builds/isc-projects/bind9/lib/isc'
make[1]: *** [Makefile:84: subdirs] Error 1
make[1]: Target 'all' not remade because of errors.
make[1]: Leaving directory '/builds/isc-projects/bind9/lib'
make: *** [Makefile:87: subdirs] Error 1
make: Target 'all' not remade because of errors.
Running after_script
Uploading artifacts for failed job
ERROR: Job failed: exit code 1
failed
gcc:sid:i386 Build
make[2]: Target 'all' not remade because of errors.
make[1]: *** [Makefile:84: subdirs] Error 1
make[1]: Target 'all' not remade because of errors.
make[1]: Leaving directory '/builds/isc-projects/bind9/lib'
make: *** [Makefile:87: subdirs] Error 1
make: Target 'all' not remade because of errors.
Running after_script
Uploading artifacts for failed job
ERROR: Job failed: exit code 1
failed
gcc:sid:amd64 Build
make[2]: Leaving directory '/builds/isc-projects/bind9/lib/isc'
make[1]: *** [Makefile:84: subdirs] Error 1
make[1]: Target 'all' not remade because of errors.
make[1]: Leaving directory '/builds/isc-projects/bind9/lib'
make: *** [Makefile:87: subdirs] Error 1
make: Target 'all' not remade because of errors.
Running after_script
Uploading artifacts for failed job
ERROR: Job failed: exit code 1
failed
gcc:alpine3.11:amd64 Build
make[2]: Leaving directory '/builds/isc-projects/bind9/lib/isc'
make[1]: *** [Makefile:84: subdirs] Error 1
make[1]: Target 'all' not remade because of errors.
make[1]: Leaving directory '/builds/isc-projects/bind9/lib'
make: *** [Makefile:87: subdirs] Error 1
make: Target 'all' not remade because of errors.
Running after_script
Uploading artifacts for failed job
ERROR: Job failed: exit code 1
failed
gcc:stretch:amd64 Build
make[1]: Leaving directory '/builds/isc-projects/bind9/lib'
make[1]: *** [subdirs] Error 1
make[1]: Target 'all' not remade because of errors.
make: *** [subdirs] Error 1
make: Target 'all' not remade because of errors.
Makefile:87: recipe for target 'subdirs' failed
Running after_script
Uploading artifacts for failed job
ERROR: Job failed: exit code 1
failed
gcc:centos6:amd64 Build
make[2]: Leaving directory `/builds/isc-projects/bind9/lib/isc'
make[1]: Leaving directory `/builds/isc-projects/bind9/lib'
make[1]: *** [subdirs] Error 1
make[1]: Target `all' not remade because of errors.
make: *** [subdirs] Error 1
make: Target `all' not remade because of errors.
Running after_script
Uploading artifacts for failed job
ERROR: Job failed: exit code 1
failed
gcc:centos7:amd64 Build
make[2]: Leaving directory `/builds/isc-projects/bind9/lib/isc'
make[1]: *** [subdirs] Error 1
make[1]: Target `all' not remade because of errors.
make[1]: Leaving directory `/builds/isc-projects/bind9/lib'
make: *** [subdirs] Error 1
make: Target `all' not remade because of errors.
Running after_script
Uploading artifacts for failed job
ERROR: Job failed: exit code 1
failed
gcc:buster:amd64 Build
make[2]: Leaving directory '/builds/isc-projects/bind9/lib/isc'
make[1]: *** [Makefile:84: subdirs] Error 1
make[1]: Target 'all' not remade because of errors.
make[1]: Leaving directory '/builds/isc-projects/bind9/lib'
make: *** [Makefile:87: subdirs] Error 1
make: Target 'all' not remade because of errors.
Running after_script
Uploading artifacts for failed job
ERROR: Job failed: exit code 1